BDBM181632 US9139577, 4.138::US9708274, 4.138
SMILES: C[C@@H](Oc1cc(F)ccc1Nc1ncnc2cc(cc(Cl)c12)N=S1(=O)CCC1)C(=O)NCC(F)(F)F
InChI Key: InChIKey=SHFKCVNKUAWFOE-GFCCVEGCSA-N
Data: 4 IC50
Activity Spreadsheet -- Enzyme Inhibition Constant Data from BindingDB
Found 4 hits for monomerid = 181632
Trg + Lig
Ki
nM
ΔG°
kcal/mole
IC50
nM
Kd
nM
EC50/IC50
nM
koff
s-1
kon
M-1s-1
pHTemp
°C
MAP kinase-interacting serine/threonine-protein kinase 2
(Homo sapiens (Human))
BDBM181632
(US9139577, 4.138 | US9708274, 4.138)
Show SMILES C[C@@H](Oc1cc(F)ccc1Nc1ncnc2cc(cc(Cl)c12)N=S1(=O)CCC1)C(=O)NCC(F)(F)F |r|
Show InChI InChI=1S/C22H20ClF4N5O3S/c1-12(21(33)28-10-22(25,26)27)35-18-7-13(24)3-4-16(18)31-20-19-15(23)8-14(9-17(19)29-11-30-20)32-36(34)5-2-6-36/h3-4,7-9,11-12H,2,5-6,10H2,1H3,(H,28,33)(H,29,30,31)/t12-/m1/s1
US Patent
n/an/a 1n/an/an/an/an/an/a
Boehringer Ingelheim International GmbH
US Patent
Assay Description
The inhibition of kinase activity of MNK2a was assessed using pre-activated GST-MNK2a. The white, 384-well OptiPlate F plates were purchased from Per...
US Patent US9139577 (2015)
BindingDB Entry DOI: 10.7270/Q2K64GT1
MAP kinase-interacting serine/threonine-protein kinase 1
(Homo sapiens (Human))
BDBM181632
(US9139577, 4.138 | US9708274, 4.138)
Show SMILES C[C@@H](Oc1cc(F)ccc1Nc1ncnc2cc(cc(Cl)c12)N=S1(=O)CCC1)C(=O)NCC(F)(F)F |r|
Show InChI InChI=1S/C22H20ClF4N5O3S/c1-12(21(33)28-10-22(25,26)27)35-18-7-13(24)3-4-16(18)31-20-19-15(23)8-14(9-17(19)29-11-30-20)32-36(34)5-2-6-36/h3-4,7-9,11-12H,2,5-6,10H2,1H3,(H,28,33)(H,29,30,31)/t12-/m1/s1
NCI pathway
Reactome pathway
US Patent
n/an/a 27n/an/an/an/a7.5n/a
EVOTEC INTERNATIONAL GMBH
US Patent
Assay Description
The inhibition of kinase activity of MNK1a was assessed using pre-activated GST-MNK1a. The 2xMKNK1 (MNK1) mixture is prepared in 50 mM HEPES pH 7.5, ...
US Patent US9708274 (2017)
BindingDB Entry DOI: 10.7270/Q2VX0JJG
MAP kinase-interacting serine/threonine-protein kinase 2
(Homo sapiens (Human))
BDBM181632
(US9139577, 4.138 | US9708274, 4.138)
Show SMILES C[C@@H](Oc1cc(F)ccc1Nc1ncnc2cc(cc(Cl)c12)N=S1(=O)CCC1)C(=O)NCC(F)(F)F |r|
Show InChI InChI=1S/C22H20ClF4N5O3S/c1-12(21(33)28-10-22(25,26)27)35-18-7-13(24)3-4-16(18)31-20-19-15(23)8-14(9-17(19)29-11-30-20)32-36(34)5-2-6-36/h3-4,7-9,11-12H,2,5-6,10H2,1H3,(H,28,33)(H,29,30,31)/t12-/m1/s1
US Patent
n/an/a 1n/an/an/an/an/a25
EVOTEC INTERNATIONAL GMBH
US Patent
Assay Description
The inhibition of kinase activity of MNK2a was assessed using pre-activated GST-MNK2a. The white, 384-well OptiPlate F plates were purchased from Per...
US Patent US9708274 (2017)
BindingDB Entry DOI: 10.7270/Q2VX0JJG
MAP kinase-interacting serine/threonine-protein kinase 1
(Homo sapiens (Human))
BDBM181632
(US9139577, 4.138 | US9708274, 4.138)
Show SMILES C[C@@H](Oc1cc(F)ccc1Nc1ncnc2cc(cc(Cl)c12)N=S1(=O)CCC1)C(=O)NCC(F)(F)F |r|
Show InChI InChI=1S/C22H20ClF4N5O3S/c1-12(21(33)28-10-22(25,26)27)35-18-7-13(24)3-4-16(18)31-20-19-15(23)8-14(9-17(19)29-11-30-20)32-36(34)5-2-6-36/h3-4,7-9,11-12H,2,5-6,10H2,1H3,(H,28,33)(H,29,30,31)/t12-/m1/s1
NCI pathway
Reactome pathway
US Patent
n/an/a 27n/an/an/an/an/an/a
Boehringer Ingelheim International GmbH
US Patent
Assay Description
The Z-LYTE biochemical assay employs a fluorescence-based, coupled-enzyme format and is based on the differential sensitivity of phosphorylated and n...
US Patent US9139577 (2015)
BindingDB Entry DOI: 10.7270/Q2K64GT1