BDBM181730 US9139585, 25::US9139585, 26
SMILES: COc1cc(ncc1[N+]#[C-])C(O)CN1C2COCC1CN(C[C@H](O)c1ccc3C(=O)OCc3c1C)C2
InChI Key: InChIKey=DJOOQYOJZQPHPJ-QGYKUFLQSA-N
Data: 2 IC50
Activity Spreadsheet -- Enzyme Inhibition Constant Data from BindingDB
Found 2 hits for monomerid = 181730
Trg + Lig
Ki
nM
ΔG°
kcal/mole
IC50
nM
Kd
nM
EC50/IC50
nM
koff
s-1
kon
M-1s-1
pHTemp
°C
ATP-sensitive inward rectifier potassium channel 1
(Homo sapiens (Human))
BDBM181730
(US9139585, 25 | US9139585, 26)
Show SMILES COc1cc(ncc1[N+]#[C-])C(O)CN1C2COCC1CN(C[C@H](O)c1ccc3C(=O)OCc3c1C)C2 |r,THB:21:20:13:15.17.16|
Show InChI InChI=1S/C26H30N4O6/c1-15-18(4-5-19-20(15)14-36-26(19)33)23(31)10-29-8-16-12-35-13-17(9-29)30(16)11-24(32)21-6-25(34-3)22(27-2)7-28-21/h4-7,16-17,23-24,31-32H,8-14H2,1,3H3/t16?,17?,23-,24?/m0/s1
Reactome pathway
US Patent
n/an/a 71n/an/an/an/a7.437
Merck Sharp & Dohme Corp.
US Patent
Assay Description
Block of Kir1.1 (ROMK1) currents was examined by whole cell voltage clamp (Hamill et. al. Pfluegers Archives 391:85-100 (1981)) using the IonWorks Qu...
US Patent US9139585 (2015)
BindingDB Entry DOI: 10.7270/Q29P30F8
ATP-sensitive inward rectifier potassium channel 1
(Homo sapiens (Human))
BDBM181730
(US9139585, 25 | US9139585, 26)
Show SMILES COc1cc(ncc1[N+]#[C-])C(O)CN1C2COCC1CN(C[C@H](O)c1ccc3C(=O)OCc3c1C)C2 |r,THB:21:20:13:15.17.16|
Show InChI InChI=1S/C26H30N4O6/c1-15-18(4-5-19-20(15)14-36-26(19)33)23(31)10-29-8-16-12-35-13-17(9-29)30(16)11-24(32)21-6-25(34-3)22(27-2)7-28-21/h4-7,16-17,23-24,31-32H,8-14H2,1,3H3/t16?,17?,23-,24?/m0/s1
Reactome pathway
US Patent
n/an/a 110n/an/an/an/a7.437
Merck Sharp & Dohme Corp.
US Patent
Assay Description
Block of Kir1.1 (ROMK1) currents was examined by whole cell voltage clamp (Hamill et. al. Pfluegers Archives 391:85-100 (1981)) using the IonWorks Qu...
US Patent US9139585 (2015)
BindingDB Entry DOI: 10.7270/Q29P30F8