BDBM181743 US9139585, 33
SMILES: OC(CN1CCN(CCc2ccc3C(=O)OCCc3c2)CC1)c1ccc2C(=O)OCc2c1C(F)(F)F
InChI Key: InChIKey=YKCREZLXMYSMST-UHFFFAOYSA-N
Data: 1 IC50
Activity Spreadsheet -- Enzyme Inhibition Constant Data from BindingDB
Found 1 hit for monomerid = 181743
Trg + Lig
Ki
nM
ΔG°
kcal/mole
IC50
nM
Kd
nM
EC50/IC50
nM
koff
s-1
kon
M-1s-1
pHTemp
°C
ATP-sensitive inward rectifier potassium channel 1
(Homo sapiens (Human))
BDBM181743
(US9139585, 33)
Show SMILES OC(CN1CCN(CCc2ccc3C(=O)OCCc3c2)CC1)c1ccc2C(=O)OCc2c1C(F)(F)F
Show InChI InChI=1S/C26H27F3N2O5/c27-26(28,29)23-20(4-3-19-21(23)15-36-25(19)34)22(32)14-31-10-8-30(9-11-31)7-5-16-1-2-18-17(13-16)6-12-35-24(18)33/h1-4,13,22,32H,5-12,14-15H2
Reactome pathway
US Patent
n/an/a 38n/an/an/an/a7.437
Merck Sharp & Dohme Corp.
US Patent
Assay Description
Block of Kir1.1 (ROMK1) currents was examined by whole cell voltage clamp (Hamill et. al. Pfluegers Archives 391:85-100 (1981)) using the IonWorks Qu...
US Patent US9139585 (2015)
BindingDB Entry DOI: 10.7270/Q29P30F8