BDBM18183 4-[(1S,7R,7aR)-1-ethyl-7-hydroxy-3-oxo-hexahydro-1H-pyrrolo[1,2-a]imidazolidin-2-yl]-2-chloro-3-methylbenzonitrile::imidazolin-2-one, 11c
SMILES: [H][C@@]12[C@H](O)CCN1C(=O)N([C@H]2CC)c1ccc(C#N)c(Cl)c1C
InChI Key: InChIKey=GHMFVPOVQMEIHB-NJZAAPMLSA-N
Data: 1 KI  1 EC50
Activity Spreadsheet -- Enzyme Inhibition Constant Data from BindingDB
Found 1 hit for monomerid = 18183
Trg + Lig
Ki
nM
ΔG°
kcal/mole
IC50
nM
Kd
nM
EC50/IC50
nM
koff
s-1
kon
M-1s-1
pHTemp
°C
Androgen Receptor
(Homo sapiens (Human))
BDBM18183
(4-[(1S,7R,7aR)-1-ethyl-7-hydroxy-3-oxo-hexahydro-1...)
Show SMILES [H][C@@]12[C@H](O)CCN1C(=O)N([C@H]2CC)c1ccc(C#N)c(Cl)c1C |r|
Show InChI InChI=1S/C16H18ClN3O2/c1-3-11-15-13(21)6-7-19(15)16(22)20(11)12-5-4-10(8-18)14(17)9(12)2/h4-5,11,13,15,21H,3,6-7H2,1-2H3/t11-,13+,15+/m0/s1
NCI pathway
Reactome pathway
0.700 -12.4n/an/a 2.60n/an/a7.422
Bristol-Myers Squibb Pharmaceutical Research Institute
Assay Description
Receptor Binding Assay (Ki)-Binding determined through direct displacement of ligand with [3H]-DHT in the MDA-453 cell line. Transactivation Assay (E...
J Med Chem 50: 3015-3025 (2007)
Article DOI: 10.1021/jm070312d
BindingDB Entry DOI: 10.7270/Q24F1P1F