BDBM18188 4-[(1S,7aR)-1-hydroxy-7-methyl-5-oxo-2,3,5,7a-tetrahydro-1H-pyrrolizin-6-yl]-2-chloro-3-methylbenzonitrile::pyrrol-2-one, 14
SMILES: [H][C@@]12[C@@H](O)CCN1C(=O)C(=C2C)c1ccc(C#N)c(Cl)c1C
InChI Key: InChIKey=NEHDVDXRTNOXMK-SWLSCSKDSA-N
Data: 1 KI  1 EC50
Activity Spreadsheet -- Enzyme Inhibition Constant Data from BindingDB
Found 1 hit for monomerid = 18188
Trg + Lig
Ki
nM
ΔG°
kcal/mole
IC50
nM
Kd
nM
EC50/IC50
nM
koff
s-1
kon
M-1s-1
pHTemp
°C
Androgen Receptor
(Homo sapiens (Human))
BDBM18188
(4-[(1S,7aR)-1-hydroxy-7-methyl-5-oxo-2,3,5,7a-tetr...)
Show SMILES [H][C@@]12[C@@H](O)CCN1C(=O)C(=C2C)c1ccc(C#N)c(Cl)c1C |r,c:10|
Show InChI InChI=1S/C16H15ClN2O2/c1-8-11(4-3-10(7-18)14(8)17)13-9(2)15-12(20)5-6-19(15)16(13)21/h3-4,12,15,20H,5-6H2,1-2H3/t12-,15+/m0/s1
NCI pathway
Reactome pathway
0.5 -12.6n/an/a 2n/an/a7.422
Bristol-Myers Squibb Pharmaceutical Research Institute
Assay Description
Receptor Binding Assay (Ki)-Binding determined through direct displacement of ligand with [3H]-DHT in the MDA-453 cell line. Transactivation Assay (E...
J Med Chem 50: 3015-3025 (2007)
Article DOI: 10.1021/jm070312d
BindingDB Entry DOI: 10.7270/Q24F1P1F