BDBM18194 1-propyl-9-(trifluoromethyl)-1H,2H,3H,6H,7H-quinolino[7,6-b][1,4]oxazin-7-one::7H-[1,4]Oxazino[3,2-g]quinolin-7-one based compound, 10c
SMILES: CCCN1CCOc2cc3[nH]c(=O)cc(c3cc12)C(F)(F)F
InChI Key: InChIKey=YEEZJFNRRUIYNH-UHFFFAOYSA-N
Data: 1 KI  1 EC50
Activity Spreadsheet -- Enzyme Inhibition Constant Data from BindingDB
Found 1 hit for monomerid = 18194
Trg + Lig
Ki
nM
ΔG°
kcal/mole
IC50
nM
Kd
nM
EC50/IC50
nM
koff
s-1
kon
M-1s-1
pHTemp
°C
Androgen Receptor
(Homo sapiens (Human))
BDBM18194
(1-propyl-9-(trifluoromethyl)-1H,2H,3H,6H,7H-quinol...)
Show SMILES CCCN1CCOc2cc3[nH]c(=O)cc(c3cc12)C(F)(F)F
Show InChI InChI=1S/C15H15F3N2O2/c1-2-3-20-4-5-22-13-8-11-9(6-12(13)20)10(15(16,17)18)7-14(21)19-11/h6-8H,2-5H2,1H3,(H,19,21)
NCI pathway
Reactome pathway
9.60 -11.4n/an/a 2.40n/an/a7.437
Ligand Pharmaceuticals Inc.
Assay Description
The compounds were evaluated in a transcriptional activation assay with hAR in a mammalian cell background (CV-1) as the primary in vitro assay. Rece...
J Med Chem 50: 2486-96 (2007)
Article DOI: 10.1021/jm061329j
BindingDB Entry DOI: 10.7270/Q20R9MNK