BDBM18214 2-ethyl-1-(2,2,2-trifluoroethyl)-9-(trifluoromethyl)-1H,2H,3H,6H,7H-quinolino[7,6-b][1,4]oxazin-7-one::7H-[1,4]Oxazino[3,2-g]quinolin-7-one based compound, 16f
SMILES: CCC1COc2cc3[nH]c(=O)cc(c3cc2N1CC(F)(F)F)C(F)(F)F
InChI Key: InChIKey=UAYIYIYEAZMBLP-UHFFFAOYSA-N
Data: 3 KI  1 EC50
Activity Spreadsheet -- Enzyme Inhibition Constant Data from BindingDB
Found 3 hits for monomerid = 18214
Trg + Lig
Ki
nM
ΔG°
kcal/mole
IC50
nM
Kd
nM
EC50/IC50
nM
koff
s-1
kon
M-1s-1
pHTemp
°C
Androgen Receptor
(Homo sapiens (Human))
BDBM18214
(2-ethyl-1-(2,2,2-trifluoroethyl)-9-(trifluoromethy...)
Show SMILES CCC1COc2cc3[nH]c(=O)cc(c3cc2N1CC(F)(F)F)C(F)(F)F
Show InChI InChI=1S/C16H14F6N2O2/c1-2-8-6-26-13-5-11-9(3-12(13)24(8)7-15(17,18)19)10(16(20,21)22)4-14(25)23-11/h3-5,8H,2,6-7H2,1H3,(H,23,25)
NCI pathway
Reactome pathway
9.40n/an/an/a 6n/an/an/an/a
Ligand Pharmaceuticals Inc.
Assay Description
The compounds were evaluated in a transcriptional activation assay with hAR in a mammalian cell background (CV-1) as the primary in vitro assay. Rece...
J Med Chem 50: 2486-96 (2007)
Article DOI: 10.1021/jm061329j
BindingDB Entry DOI: 10.7270/Q20R9MNK
Progesterone receptor
(Homo sapiens (Human))
BDBM18214
(2-ethyl-1-(2,2,2-trifluoroethyl)-9-(trifluoromethy...)
Show SMILES CCC1COc2cc3[nH]c(=O)cc(c3cc2N1CC(F)(F)F)C(F)(F)F
Show InChI InChI=1S/C16H14F6N2O2/c1-2-8-6-26-13-5-11-9(3-12(13)24(8)7-15(17,18)19)10(16(20,21)22)4-14(25)23-11/h3-5,8H,2,6-7H2,1H3,(H,23,25)
2.80E+3n/an/an/an/an/an/an/an/a
Ligand Pharmaceuticals Inc.
Assay Description
The procedure for the cross reactivity receptor binding assays was using baculovirus-expressed receptors. After correcting for nonspecific binding, I...
J Med Chem 50: 2486-96 (2007)
Article DOI: 10.1021/jm061329j
BindingDB Entry DOI: 10.7270/Q20R9MNK
Glucocorticoid receptor
(Homo sapiens (Human))
BDBM18214
(2-ethyl-1-(2,2,2-trifluoroethyl)-9-(trifluoromethy...)
Show SMILES CCC1COc2cc3[nH]c(=O)cc(c3cc2N1CC(F)(F)F)C(F)(F)F
Show InChI InChI=1S/C16H14F6N2O2/c1-2-8-6-26-13-5-11-9(3-12(13)24(8)7-15(17,18)19)10(16(20,21)22)4-14(25)23-11/h3-5,8H,2,6-7H2,1H3,(H,23,25)
6.50E+3n/an/an/an/an/an/an/an/a
Ligand Pharmaceuticals Inc.
Assay Description
The procedure for the cross reactivity receptor binding assays was using baculovirus-expressed receptors. After correcting for nonspecific binding, I...
J Med Chem 50: 2486-96 (2007)
Article DOI: 10.1021/jm061329j
BindingDB Entry DOI: 10.7270/Q20R9MNK