BDBM18233 6-[2-({2,4-diamino-5-methylpyrido[2,3-d]pyrimidin-6-yl}methyl)-4-methoxyphenyl]hex-5-ynoic acid::Piritrexim analogue, 14
SMILES: COc1ccc(C#CCCCC(O)=O)c(Cc2cnc3nc(N)nc(N)c3c2C)c1
InChI Key: InChIKey=MAWHZPJVFGJFTF-UHFFFAOYSA-N
Data: 4 IC50
PDB links: 1 PDB ID matches this monomer.
Activity Spreadsheet -- Enzyme Inhibition Constant Data from BindingDB
Found 4 hits for monomerid = 18233
Trg + Lig
Ki
nM
ΔG°
kcal/mole
IC50
nM
Kd
nM
EC50/IC50
nM
koff
s-1
kon
M-1s-1
pHTemp
°C
Dihydrofolate Reductase (DHFR)
(Pneumocystis carinii)
BDBM18233
(6-[2-({2,4-diamino-5-methylpyrido[2,3-d]pyrimidin-...)
Show SMILES COc1ccc(C#CCCCC(O)=O)c(Cc2cnc3nc(N)nc(N)c3c2C)c1
Show InChI InChI=1S/C22H23N5O3/c1-13-16(12-25-21-19(13)20(23)26-22(24)27-21)10-15-11-17(30-2)9-8-14(15)6-4-3-5-7-18(28)29/h8-9,11-12H,3,5,7,10H2,1-2H3,(H,28,29)(H4,23,24,25,26,27)
n/an/a 1.20n/an/an/an/a7.437
Harvard Medical School
Assay Description
Dihydrofolate reductase was assayed with no inhibitor and with a series of concentrations of inhibitors to allow for a range of inhibition from 10 to...
J Med Chem 48: 4420-31 (2005)
Article DOI: 10.1021/jm0581718
BindingDB Entry DOI: 10.7270/Q2W0946F
3D
3D Structure (crystal)
Dihydrofolate reductase
(Rattus norvegicus (rat))
BDBM18233
(6-[2-({2,4-diamino-5-methylpyrido[2,3-d]pyrimidin-...)
Show SMILES COc1ccc(C#CCCCC(O)=O)c(Cc2cnc3nc(N)nc(N)c3c2C)c1
Show InChI InChI=1S/C22H23N5O3/c1-13-16(12-25-21-19(13)20(23)26-22(24)27-21)10-15-11-17(30-2)9-8-14(15)6-4-3-5-7-18(28)29/h8-9,11-12H,3,5,7,10H2,1-2H3,(H,28,29)(H4,23,24,25,26,27)
Reactome pathway
n/an/a 24n/an/an/an/an/an/a
Harvard Medical School
Assay Description
Dihydrofolate reductase was assayed with no inhibitor and with a series of concentrations of inhibitors to allow for a range of inhibition from 10 to...
J Med Chem 48: 4420-31 (2005)
Article DOI: 10.1021/jm0581718
BindingDB Entry DOI: 10.7270/Q2W0946F
Dihydrofolate reductase
(Mycobacterium avium)
BDBM18233
(6-[2-({2,4-diamino-5-methylpyrido[2,3-d]pyrimidin-...)
Show SMILES COc1ccc(C#CCCCC(O)=O)c(Cc2cnc3nc(N)nc(N)c3c2C)c1
Show InChI InChI=1S/C22H23N5O3/c1-13-16(12-25-21-19(13)20(23)26-22(24)27-21)10-15-11-17(30-2)9-8-14(15)6-4-3-5-7-18(28)29/h8-9,11-12H,3,5,7,10H2,1-2H3,(H,28,29)(H4,23,24,25,26,27)
n/an/a 1.30n/an/an/an/an/an/a
Harvard Medical School
Assay Description
Dihydrofolate reductase was assayed with no inhibitor and with a series of concentrations of inhibitors to allow for a range of inhibition from 10 to...
J Med Chem 48: 4420-31 (2005)
Article DOI: 10.1021/jm0581718
BindingDB Entry DOI: 10.7270/Q2W0946F
Dihydrofolate reductase (DHFR)
(Toxoplasma gondii)
BDBM18233
(6-[2-({2,4-diamino-5-methylpyrido[2,3-d]pyrimidin-...)
Show SMILES COc1ccc(C#CCCCC(O)=O)c(Cc2cnc3nc(N)nc(N)c3c2C)c1
Show InChI InChI=1S/C22H23N5O3/c1-13-16(12-25-21-19(13)20(23)26-22(24)27-21)10-15-11-17(30-2)9-8-14(15)6-4-3-5-7-18(28)29/h8-9,11-12H,3,5,7,10H2,1-2H3,(H,28,29)(H4,23,24,25,26,27)
n/an/a 5.80n/an/an/an/an/an/a
Harvard Medical School
Assay Description
Dihydrofolate reductase was assayed with no inhibitor and with a series of concentrations of inhibitors to allow for a range of inhibition from 10 to...
J Med Chem 48: 4420-31 (2005)
Article DOI: 10.1021/jm0581718
BindingDB Entry DOI: 10.7270/Q2W0946F