BDBM182483 US9145392, 184
SMILES: COc1c(N)ncnc1N1CCC(CC1)c1nc(cn1CC1CNC1)-c1ccc(F)c(C)c1
InChI Key: InChIKey=KVMVAUMDSYMRST-UHFFFAOYSA-N
Data: 2 IC50
Activity Spreadsheet -- Enzyme Inhibition Constant Data from BindingDB
Found 2 hits for monomerid = 182483
Trg + Lig
Ki
nM
ΔG°
kcal/mole
IC50
nM
Kd
nM
EC50/IC50
nM
koff
s-1
kon
M-1s-1
pHTemp
°C
RAC-alpha serine/threonine-protein kinase
(Homo sapiens (Human))
BDBM182483
(US9145392, 184)
Show SMILES COc1c(N)ncnc1N1CCC(CC1)c1nc(cn1CC1CNC1)-c1ccc(F)c(C)c1
Show InChI InChI=1S/C24H30FN7O/c1-15-9-18(3-4-19(15)25)20-13-32(12-16-10-27-11-16)23(30-20)17-5-7-31(8-6-17)24-21(33-2)22(26)28-14-29-24/h3-4,9,13-14,16-17,27H,5-8,10-12H2,1-2H3,(H2,26,28,29)
US Patent
n/an/a 2.30n/an/an/an/a7.5n/a
Merck Patent GmbH
US Patent
Assay Description
A TTP Mosquito liquid handling instrument is used to place 125n1 of the appropriate concentration of inhibitor in 100% DMSO (for a dose response curv...
US Patent US9145392 (2015)
BindingDB Entry DOI: 10.7270/Q2NZ86D2
Ribosomal protein S6 kinase (P70S6K)
(Homo sapiens (Human))
BDBM182483
(US9145392, 184)
Show SMILES COc1c(N)ncnc1N1CCC(CC1)c1nc(cn1CC1CNC1)-c1ccc(F)c(C)c1
Show InChI InChI=1S/C24H30FN7O/c1-15-9-18(3-4-19(15)25)20-13-32(12-16-10-27-11-16)23(30-20)17-5-7-31(8-6-17)24-21(33-2)22(26)28-14-29-24/h3-4,9,13-14,16-17,27H,5-8,10-12H2,1-2H3,(H2,26,28,29)
NCI pathway
Reactome pathway
US Patent
n/an/a 0.260n/an/an/an/a7.525
Merck Patent GmbH
US Patent
Assay Description
P70S6K inhibitor compounds are diluted and plated in 96 well plates. A reaction mixture including the following components is then added to the compo...
US Patent US9145392 (2015)
BindingDB Entry DOI: 10.7270/Q2NZ86D2