BDBM182536 US9145392, 237
SMILES: Nc1ncnc(N2CCC(CC2)c2nc(cn2CCN2CCCC2)-c2ccc(F)cc2)c1Cl
InChI Key: InChIKey=WJQJOCPGZFNQLW-UHFFFAOYSA-N
Data: 2 IC50
Activity Spreadsheet -- Enzyme Inhibition Constant Data from BindingDB
Found 2 hits for monomerid = 182536
Trg + Lig
Ki
nM
ΔG°
kcal/mole
IC50
nM
Kd
nM
EC50/IC50
nM
koff
s-1
kon
M-1s-1
pHTemp
°C
RAC-alpha serine/threonine-protein kinase
(Homo sapiens (Human))
BDBM182536
(US9145392, 237)
Show SMILES Nc1ncnc(N2CCC(CC2)c2nc(cn2CCN2CCCC2)-c2ccc(F)cc2)c1Cl
Show InChI InChI=1S/C24H29ClFN7/c25-21-22(27)28-16-29-24(21)32-11-7-18(8-12-32)23-30-20(17-3-5-19(26)6-4-17)15-33(23)14-13-31-9-1-2-10-31/h3-6,15-16,18H,1-2,7-14H2,(H2,27,28,29)
US Patent
n/an/a 3.30n/an/an/an/a7.5n/a
Merck Patent GmbH
US Patent
Assay Description
A TTP Mosquito liquid handling instrument is used to place 125n1 of the appropriate concentration of inhibitor in 100% DMSO (for a dose response curv...
US Patent US9145392 (2015)
BindingDB Entry DOI: 10.7270/Q2NZ86D2
Ribosomal protein S6 kinase (P70S6K)
(Homo sapiens (Human))
BDBM182536
(US9145392, 237)
Show SMILES Nc1ncnc(N2CCC(CC2)c2nc(cn2CCN2CCCC2)-c2ccc(F)cc2)c1Cl
Show InChI InChI=1S/C24H29ClFN7/c25-21-22(27)28-16-29-24(21)32-11-7-18(8-12-32)23-30-20(17-3-5-19(26)6-4-17)15-33(23)14-13-31-9-1-2-10-31/h3-6,15-16,18H,1-2,7-14H2,(H2,27,28,29)
NCI pathway
Reactome pathway
US Patent
n/an/a 0.800n/an/an/an/a7.525
Merck Patent GmbH
US Patent
Assay Description
P70S6K inhibitor compounds are diluted and plated in 96 well plates. A reaction mixture including the following components is then added to the compo...
US Patent US9145392 (2015)
BindingDB Entry DOI: 10.7270/Q2NZ86D2