BDBM182678 US9145392, 379
SMILES: CC(C)N(C)CCn1cc(nc1C1CCN(CC1)c1ncnc(N)c1C#N)-c1ccc(F)c(C)c1
InChI Key: InChIKey=JKACOTYFJGVPGL-UHFFFAOYSA-N
Data: 2 IC50
Activity Spreadsheet -- Enzyme Inhibition Constant Data from BindingDB
Found 2 hits for monomerid = 182678
Trg + Lig
Ki
nM
ΔG°
kcal/mole
IC50
nM
Kd
nM
EC50/IC50
nM
koff
s-1
kon
M-1s-1
pHTemp
°C
RAC-alpha serine/threonine-protein kinase
(Homo sapiens (Human))
BDBM182678
(US9145392, 379)
Show SMILES CC(C)N(C)CCn1cc(nc1C1CCN(CC1)c1ncnc(N)c1C#N)-c1ccc(F)c(C)c1
Show InChI InChI=1S/C26H33FN8/c1-17(2)33(4)11-12-35-15-23(20-5-6-22(27)18(3)13-20)32-25(35)19-7-9-34(10-8-19)26-21(14-28)24(29)30-16-31-26/h5-6,13,15-17,19H,7-12H2,1-4H3,(H2,29,30,31)
US Patent
n/an/a 2.70n/an/an/an/a7.5n/a
Merck Patent GmbH
US Patent
Assay Description
A TTP Mosquito liquid handling instrument is used to place 125n1 of the appropriate concentration of inhibitor in 100% DMSO (for a dose response curv...
US Patent US9145392 (2015)
BindingDB Entry DOI: 10.7270/Q2NZ86D2
Ribosomal protein S6 kinase (P70S6K)
(Homo sapiens (Human))
BDBM182678
(US9145392, 379)
Show SMILES CC(C)N(C)CCn1cc(nc1C1CCN(CC1)c1ncnc(N)c1C#N)-c1ccc(F)c(C)c1
Show InChI InChI=1S/C26H33FN8/c1-17(2)33(4)11-12-35-15-23(20-5-6-22(27)18(3)13-20)32-25(35)19-7-9-34(10-8-19)26-21(14-28)24(29)30-16-31-26/h5-6,13,15-17,19H,7-12H2,1-4H3,(H2,29,30,31)
NCI pathway
Reactome pathway
US Patent
n/an/a 0.800n/an/an/an/a7.525
Merck Patent GmbH
US Patent
Assay Description
P70S6K inhibitor compounds are diluted and plated in 96 well plates. A reaction mixture including the following components is then added to the compo...
US Patent US9145392 (2015)
BindingDB Entry DOI: 10.7270/Q2NZ86D2