BDBM182688 US9145392, 389
SMILES: Cc1cc(ccc1F)-c1cn(CCNC2CCCC2)c(n1)C1CCN(CC1)c1ncnc(N)c1C#N
InChI Key: InChIKey=DCGJPYQDBNQMHR-UHFFFAOYSA-N
Data: 2 IC50
Activity Spreadsheet -- Enzyme Inhibition Constant Data from BindingDB
Found 2 hits for monomerid = 182688
Trg + Lig
Ki
nM
ΔG°
kcal/mole
IC50
nM
Kd
nM
EC50/IC50
nM
koff
s-1
kon
M-1s-1
pHTemp
°C
RAC-alpha serine/threonine-protein kinase
(Homo sapiens (Human))
BDBM182688
(US9145392, 389)
Show SMILES Cc1cc(ccc1F)-c1cn(CCNC2CCCC2)c(n1)C1CCN(CC1)c1ncnc(N)c1C#N
Show InChI InChI=1S/C27H33FN8/c1-18-14-20(6-7-23(18)28)24-16-36(13-10-31-21-4-2-3-5-21)26(34-24)19-8-11-35(12-9-19)27-22(15-29)25(30)32-17-33-27/h6-7,14,16-17,19,21,31H,2-5,8-13H2,1H3,(H2,30,32,33)
US Patent
n/an/a 0.700n/an/an/an/a7.5n/a
Merck Patent GmbH
US Patent
Assay Description
A TTP Mosquito liquid handling instrument is used to place 125n1 of the appropriate concentration of inhibitor in 100% DMSO (for a dose response curv...
US Patent US9145392 (2015)
BindingDB Entry DOI: 10.7270/Q2NZ86D2
Ribosomal protein S6 kinase (P70S6K)
(Homo sapiens (Human))
BDBM182688
(US9145392, 389)
Show SMILES Cc1cc(ccc1F)-c1cn(CCNC2CCCC2)c(n1)C1CCN(CC1)c1ncnc(N)c1C#N
Show InChI InChI=1S/C27H33FN8/c1-18-14-20(6-7-23(18)28)24-16-36(13-10-31-21-4-2-3-5-21)26(34-24)19-8-11-35(12-9-19)27-22(15-29)25(30)32-17-33-27/h6-7,14,16-17,19,21,31H,2-5,8-13H2,1H3,(H2,30,32,33)
NCI pathway
Reactome pathway
US Patent
n/an/a 0.900n/an/an/an/a7.525
Merck Patent GmbH
US Patent
Assay Description
P70S6K inhibitor compounds are diluted and plated in 96 well plates. A reaction mixture including the following components is then added to the compo...
US Patent US9145392 (2015)
BindingDB Entry DOI: 10.7270/Q2NZ86D2