BDBM182804 US9145414, 209
SMILES: N[C@H]1CCCC[C@H]1Nc1nnc(C(N)=O)c(Nc2cccc3nn(cc23)C(F)F)n1
InChI Key: InChIKey=YNRJNHZGBBFDAL-GXFFZTMASA-N
Data: 1 IC50
Activity Spreadsheet -- Enzyme Inhibition Constant Data from BindingDB
Found 1 hit for monomerid = 182804
Trg + Lig
Ki
nM
ΔG°
kcal/mole
IC50
nM
Kd
nM
EC50/IC50
nM
koff
s-1
kon
M-1s-1
pHTemp
°C
Tyrosine-protein kinase SYK
(Homo sapiens (Human))
BDBM182804
(US9145414, 209)
Show SMILES N[C@H]1CCCC[C@H]1Nc1nnc(C(N)=O)c(Nc2cccc3nn(cc23)C(F)F)n1 |r|
Show InChI InChI=1S/C18H21F2N9O/c19-17(20)29-8-9-11(6-3-7-12(9)28-29)23-16-14(15(22)30)26-27-18(25-16)24-13-5-2-1-4-10(13)21/h3,6-8,10,13,17H,1-2,4-5,21H2,(H2,22,30)(H2,23,24,25,27)/t10-,13+/m0/s1
NCI pathway
Reactome pathway
US Patent
n/an/a 0.330n/an/an/an/a7.525
TAIHO PHARMACEUTICAL CO., LTD.
US Patent
Assay Description
The in vitro inhibitory activity of the compound of the present invention against Syk kinase activity was assayed under the following conditions: the...
US Patent US9145414 (2015)
BindingDB Entry DOI: 10.7270/Q2513X18