BDBM182806 US9145414, 220
SMILES: N[C@H]1CCCC[C@H]1Nc1nnc(C(N)=O)c(Nc2ccc3sccc3c2)n1
InChI Key: InChIKey=HRKFAAQEOBKZNP-QWHCGFSZSA-N
Data: 1 IC50
Activity Spreadsheet -- Enzyme Inhibition Constant Data from BindingDB
Found 1 hit for monomerid = 182806
Trg + Lig
Ki
nM
ΔG°
kcal/mole
IC50
nM
Kd
nM
EC50/IC50
nM
koff
s-1
kon
M-1s-1
pHTemp
°C
Tyrosine-protein kinase SYK
(Homo sapiens (Human))
BDBM182806
(US9145414, 220)
Show SMILES N[C@H]1CCCC[C@H]1Nc1nnc(C(N)=O)c(Nc2ccc3sccc3c2)n1 |r|
Show InChI InChI=1S/C18H21N7OS/c19-12-3-1-2-4-13(12)22-18-23-17(15(16(20)26)24-25-18)21-11-5-6-14-10(9-11)7-8-27-14/h5-9,12-13H,1-4,19H2,(H2,20,26)(H2,21,22,23,25)/t12-,13+/m0/s1
NCI pathway
Reactome pathway
US Patent
n/an/a 0.260n/an/an/an/a7.525
TAIHO PHARMACEUTICAL CO., LTD.
US Patent
Assay Description
The in vitro inhibitory activity of the compound of the present invention against Syk kinase activity was assayed under the following conditions: the...
US Patent US9145414 (2015)
BindingDB Entry DOI: 10.7270/Q2513X18