BDBM18313 (2R,4S,5S,7S)-5-amino-N-(2-acetamidoethyl)-4-hydroxy-7-{[4-methoxy-3-(3-methoxypropoxy)phenyl]methyl}-2,8-dimethylnonanamide::8-phenyl-octanecarboxamide peptidomimetic, 70
SMILES: COCCCOc1cc(C[C@@H](C[C@H](N)[C@@H](O)C[C@@H](C)C(=O)NCCNC(C)=O)C(C)C)ccc1OC
InChI Key: InChIKey=FXYJEKVEPVJLQA-DLTYFMDKSA-N
Data: 1 IC50
Activity Spreadsheet -- Enzyme Inhibition Constant Data from BindingDB
Found 1 hit for monomerid = 18313
Trg + Lig
Ki
nM
ΔG°
kcal/mole
IC50
nM
Kd
nM
EC50/IC50
nM
koff
s-1
kon
M-1s-1
pHTemp
°C
Renin
(Homo sapiens (Human))
BDBM18313
((2R,4S,5S,7S)-5-amino-N-(2-acetamidoethyl)-4-hydro...)
Show SMILES COCCCOc1cc(C[C@@H](C[C@H](N)[C@@H](O)C[C@@H](C)C(=O)NCCNC(C)=O)C(C)C)ccc1OC |r|
Show InChI InChI=1S/C27H47N3O6/c1-18(2)22(15-21-8-9-25(35-6)26(16-21)36-13-7-12-34-5)17-23(28)24(32)14-19(3)27(33)30-11-10-29-20(4)31/h8-9,16,18-19,22-24,32H,7,10-15,17,28H2,1-6H3,(H,29,31)(H,30,33)/t19-,22+,23+,24+/m1/s1
Reactome pathway
n/an/a 0.300n/an/an/an/an/an/a
Novartis Pharmaceuticals
Assay Description
Enzyme inhibition by test compounds was determined using human recombinant renin, incubating with a synthetic tetradecapeptide substrate. The Ang I g...
J Med Chem 50: 4818-31 (2007)
Article DOI: 10.1021/jm070314y
BindingDB Entry DOI: 10.7270/Q2MG7MSF