BDBM18340 (2S,4S,5S,7S)-5-amino-4-hydroxy-7-{[4-methoxy-3-(3-methoxypropoxy)phenyl]methyl}-8-methyl-N-{[(2S)-5-oxopyrrolidin-2-yl]methyl}-2-(propan-2-yl)nonanamide::2,7-dialkyl-substituted 8-phenyl-octanecarboxamide, 50
SMILES: COCCCOc1cc(C[C@@H](C[C@H](N)[C@@H](O)C[C@@H](C(C)C)C(=O)NC[C@@H]2CCC(=O)N2)C(C)C)ccc1OC
InChI Key: InChIKey=BXRXSNOPXSYVNH-LROMGURASA-N
Data: 1 IC50
Activity Spreadsheet -- Enzyme Inhibition Constant Data from BindingDB
Found 1 hit for monomerid = 18340
Trg + Lig
Ki
nM
ΔG°
kcal/mole
IC50
nM
Kd
nM
EC50/IC50
nM
koff
s-1
kon
M-1s-1
pHTemp
°C
Renin
(Homo sapiens (Human))
BDBM18340
((2S,4S,5S,7S)-5-amino-4-hydroxy-7-{[4-methoxy-3-(3...)
Show SMILES COCCCOc1cc(C[C@@H](C[C@H](N)[C@@H](O)C[C@@H](C(C)C)C(=O)NC[C@@H]2CCC(=O)N2)C(C)C)ccc1OC |r|
Show InChI InChI=1S/C30H51N3O6/c1-19(2)22(14-21-8-10-27(38-6)28(15-21)39-13-7-12-37-5)16-25(31)26(34)17-24(20(3)4)30(36)32-18-23-9-11-29(35)33-23/h8,10,15,19-20,22-26,34H,7,9,11-14,16-18,31H2,1-6H3,(H,32,36)(H,33,35)/t22-,23-,24-,25-,26-/m0/s1
Reactome pathway
n/an/a 0.600n/an/an/an/an/an/a
Novartis Pharmaceuticals
Assay Description
Enzyme inhibition by test compounds was determined using human recombinant renin, incubating with a synthetic tetradecapeptide substrate. The Ang I g...
J Med Chem 50: 4832-44 (2007)
Article DOI: 10.1021/jm070316i
BindingDB Entry DOI: 10.7270/Q2GQ6W1P