BDBM183846 US9150526, 99
SMILES: COc1cc(C)cc(OC)c1-c1cc(F)cc(c1)C(CC(O)=O)c1ncc(C)s1
InChI Key: InChIKey=YQCGAFIBRSFAIV-UHFFFAOYSA-N
Data: 1 IC50
Activity Spreadsheet -- Enzyme Inhibition Constant Data from BindingDB
Found 1 hit for monomerid = 183846
Trg + Lig
Ki
nM
ΔG°
kcal/mole
IC50
nM
Kd
nM
EC50/IC50
nM
koff
s-1
kon
M-1s-1
pHTemp
°C
Cathepsin A (CTSA)
(Homo sapiens (Human))
BDBM183846
(US9150526, 99)
Show SMILES COc1cc(C)cc(OC)c1-c1cc(F)cc(c1)C(CC(O)=O)c1ncc(C)s1
Show InChI InChI=1S/C22H22FNO4S/c1-12-5-18(27-3)21(19(6-12)28-4)15-7-14(8-16(23)9-15)17(10-20(25)26)22-24-11-13(2)29-22/h5-9,11,17H,10H2,1-4H3,(H,25,26)
US Patent
n/an/a 28n/an/an/an/a6.037
Sanofi
US Patent
Assay Description
Recombinant human cathepsin A (residues 29-480, with a C-terminal 10-His tag; R&D Systems, #1049-SE) was proteolytically activated with recombinant h...
US Patent US9150526 (2015)
BindingDB Entry DOI: 10.7270/Q2QR4VXP