null
SMILES: COc1cc(C)cc(OC)c1-c1cc(Cl)cc(c1)C(CC(O)=O)c1nnc(C)o1
InChI Key: InChIKey=OYWDYVMHSSTKHM-UHFFFAOYSA-N
Activity Spreadsheet -- Enzyme Inhibition Constant Data from BindingDB
Found 1 hit for monomerid = 183902
Trg + Lig
Ki
nM
ΔG°
kcal/mole
IC50
nM
Kd
nM
EC50/IC50
nM
koff
s-1
kon
M-1s-1
pHTemp
°C
Lysosomal protective protein [29-480]
(Homo sapiens (Human))
BDBM183902
(US9150526, 155)
Show SMILES COc1cc(C)cc(OC)c1-c1cc(Cl)cc(c1)C(CC(O)=O)c1nnc(C)o1
Show InChI InChI=1S/C21H21ClN2O5/c1-11-5-17(27-3)20(18(6-11)28-4)14-7-13(8-15(22)9-14)16(10-19(25)26)21-24-23-12(2)29-21/h5-9,16H,10H2,1-4H3,(H,25,26)
US Patent
n/an/a 8n/an/an/an/a6.037
Sanofi
US Patent
Assay Description
Recombinant human cathepsin A (residues 29-480, with a C-terminal 10-His tag; R&D Systems, #1049-SE) was proteolytically activated with recombinant h...
US Patent US9150526 (2015)
BindingDB Entry DOI: 10.7270/Q2QR4VXP