BDBM183940 US9150526, 203
SMILES: COc1ccc(cc1-c1cc(cc(c1)C(F)(F)F)C(CC(O)=O)c1nnc(C)o1)C(C)(C)C
InChI Key: InChIKey=BWOLWMZNSLBIOP-UHFFFAOYSA-N
Data: 1 IC50
Activity Spreadsheet -- Enzyme Inhibition Constant Data from BindingDB
Found 1 hit for monomerid = 183940
Trg + Lig
Ki
nM
ΔG°
kcal/mole
IC50
nM
Kd
nM
EC50/IC50
nM
koff
s-1
kon
M-1s-1
pHTemp
°C
Cathepsin A (CTSA)
(Homo sapiens (Human))
BDBM183940
(US9150526, 203)
Show SMILES COc1ccc(cc1-c1cc(cc(c1)C(F)(F)F)C(CC(O)=O)c1nnc(C)o1)C(C)(C)C
Show InChI InChI=1S/C24H25F3N2O4/c1-13-28-29-22(33-13)19(12-21(30)31)15-8-14(9-17(10-15)24(25,26)27)18-11-16(23(2,3)4)6-7-20(18)32-5/h6-11,19H,12H2,1-5H3,(H,30,31)
US Patent
n/an/a 17n/an/an/an/a6.037
Sanofi
US Patent
Assay Description
Recombinant human cathepsin A (residues 29-480, with a C-terminal 10-His tag; R&D Systems, #1049-SE) was proteolytically activated with recombinant h...
US Patent US9150526 (2015)
BindingDB Entry DOI: 10.7270/Q2QR4VXP