BDBM183955 US9150526, 218
SMILES: COc1ccc(F)cc1-c1cc(cc(c1)C(F)(F)F)C(CC(O)=O)c1nnc(C)o1
InChI Key: InChIKey=WOKIAMLNFBVNQG-UHFFFAOYSA-N
Data: 1 IC50
Activity Spreadsheet -- Enzyme Inhibition Constant Data from BindingDB
Found 1 hit for monomerid = 183955
Trg + Lig
Ki
nM
ΔG°
kcal/mole
IC50
nM
Kd
nM
EC50/IC50
nM
koff
s-1
kon
M-1s-1
pHTemp
°C
Cathepsin A (CTSA)
(Homo sapiens (Human))
BDBM183955
(US9150526, 218)
Show SMILES COc1ccc(F)cc1-c1cc(cc(c1)C(F)(F)F)C(CC(O)=O)c1nnc(C)o1
Show InChI InChI=1S/C20H16F4N2O4/c1-10-25-26-19(30-10)16(9-18(27)28)12-5-11(6-13(7-12)20(22,23)24)15-8-14(21)3-4-17(15)29-2/h3-8,16H,9H2,1-2H3,(H,27,28)
US Patent
n/an/a 12n/an/an/an/a6.037
Sanofi
US Patent
Assay Description
Recombinant human cathepsin A (residues 29-480, with a C-terminal 10-His tag; R&D Systems, #1049-SE) was proteolytically activated with recombinant h...
US Patent US9150526 (2015)
BindingDB Entry DOI: 10.7270/Q2QR4VXP