BDBM18409 (3R,5S)-6-[(3-{[(3,4-difluorophenyl)methyl](methyl)carbamoyl}-1-(4-fluorophenyl)-4-(propan-2-yl)-1H-pyrazol-5-yl)oxy]-3,5-dihydroxyhexanoic acid::oxypyrazole, 4v
SMILES: CC(C)c1c(OC[C@@H](O)C[C@@H](O)CC(O)=O)n(nc1C(=O)N(C)Cc1ccc(F)c(F)c1)-c1ccc(F)cc1
InChI Key: InChIKey=YQOFXCGHHBKOJH-UXHICEINSA-N
Data: 1 IC50
Activity Spreadsheet -- Enzyme Inhibition Constant Data from BindingDB
Found 1 hit for monomerid = 18409
Trg + Lig
Ki
nM
ΔG°
kcal/mole
IC50
nM
Kd
nM
EC50/IC50
nM
koff
s-1
kon
M-1s-1
pHTemp
°C
HMG-CoA reductase
(Rattus norvegicus (rat))
BDBM18409
((3R,5S)-6-[(3-{[(3,4-difluorophenyl)methyl](methyl...)
Show SMILES CC(C)c1c(OC[C@@H](O)C[C@@H](O)CC(O)=O)n(nc1C(=O)N(C)Cc1ccc(F)c(F)c1)-c1ccc(F)cc1 |r|
Show InChI InChI=1S/C27H30F3N3O6/c1-15(2)24-25(26(38)32(3)13-16-4-9-21(29)22(30)10-16)31-33(18-7-5-17(28)6-8-18)27(24)39-14-20(35)11-19(34)12-23(36)37/h4-10,15,19-20,34-35H,11-14H2,1-3H3,(H,36,37)/t19-,20+/m1/s1
Reactome pathway
n/an/a 5.70n/an/an/an/an/an/a
Pfizer
Assay Description
Assay for HMG-CoA reductase was based on the conversion of isotopically labeled HMG-CoA to mevalonic acid using rat liver microsomes as enzyme source...
Bioorg Med Chem Lett 17: 5567-72 (2007)
Article DOI: 10.1016/j.bmcl.2007.08.004
BindingDB Entry DOI: 10.7270/Q2ZS2TS7