BDBM184215 US9150577, 73
SMILES: CC(C)n1c(NC(=O)c2ccc3cc4C(=O)NCCC(C)(C)n4c3c2)nc2ccccc12
InChI Key: InChIKey=RWILYFWNXVPXSL-UHFFFAOYSA-N
Data: 1 IC50
Activity Spreadsheet -- Enzyme Inhibition Constant Data from BindingDB
Found 1 hit for monomerid = 184215
Trg + Lig
Ki
nM
ΔG°
kcal/mole
IC50
nM
Kd
nM
EC50/IC50
nM
koff
s-1
kon
M-1s-1
pHTemp
°C
Ribosomal protein S6 kinase alpha 2
(Homo sapiens (Human))
BDBM184215
(US9150577, 73)
Show SMILES CC(C)n1c(NC(=O)c2ccc3cc4C(=O)NCCC(C)(C)n4c3c2)nc2ccccc12
Show InChI InChI=1S/C25H27N5O2/c1-15(2)29-19-8-6-5-7-18(19)27-24(29)28-22(31)17-10-9-16-13-21-23(32)26-12-11-25(3,4)30(21)20(16)14-17/h5-10,13-15H,11-12H2,1-4H3,(H,26,32)(H,27,28,31)
Reactome pathway
US Patent
n/an/a 2n/an/an/an/a7.5n/a
Boehringer Ingelheim International GmbH
US Patent
Assay Description
Human RSK2 protein, purchased from Invitrogen, is used to measure kinase activity utilizing Kinase Glo Plus (Promega) a homogeneous assay technology,...
US Patent US9150577 (2015)
BindingDB Entry DOI: 10.7270/Q2GB22V6