BDBM184289 US9150577, 165
SMILES: CC(C)n1c(NC(=O)c2ccc3cc4C(=O)NCCC(C)n4c3c2)nc2ccccc12
InChI Key: InChIKey=YVIQVJHNCXAZGY-UHFFFAOYSA-N
Data: 1 IC50
Activity Spreadsheet -- Enzyme Inhibition Constant Data from BindingDB
Found 1 hit for monomerid = 184289
Trg + Lig
Ki
nM
ΔG°
kcal/mole
IC50
nM
Kd
nM
EC50/IC50
nM
koff
s-1
kon
M-1s-1
pHTemp
°C
Ribosomal protein S6 kinase alpha 2
(Homo sapiens (Human))
BDBM184289
(US9150577, 165)
Show SMILES CC(C)n1c(NC(=O)c2ccc3cc4C(=O)NCCC(C)n4c3c2)nc2ccccc12
Show InChI InChI=1S/C24H25N5O2/c1-14(2)28-19-7-5-4-6-18(19)26-24(28)27-22(30)17-9-8-16-12-21-23(31)25-11-10-15(3)29(21)20(16)13-17/h4-9,12-15H,10-11H2,1-3H3,(H,25,31)(H,26,27,30)
Reactome pathway
US Patent
n/an/a 1.80n/an/an/an/a7.5n/a
Boehringer Ingelheim International GmbH
US Patent
Assay Description
Human RSK2 protein, purchased from Invitrogen, is used to measure kinase activity utilizing Kinase Glo Plus (Promega) a homogeneous assay technology,...
US Patent US9150577 (2015)
BindingDB Entry DOI: 10.7270/Q2GB22V6