BDBM18431 Aminoquinoline compound, 16::N-[4-methyl-2-(morpholin-4-yl)quinolin-6-yl]-4-propylcyclohexane-1-carboxamide
SMILES: CCCC1CCC(CC1)C(=O)Nc1ccc2nc(cc(C)c2c1)N1CCOCC1
InChI Key: InChIKey=OUDZANWEQJRFFQ-UHFFFAOYSA-N
Data: 1 KI  1 IC50
Activity Spreadsheet -- Enzyme Inhibition Constant Data from BindingDB
Found 1 hit for monomerid = 18431
Trg + Lig
Ki
nM
ΔG°
kcal/mole
IC50
nM
Kd
nM
EC50/IC50
nM
koff
s-1
kon
M-1s-1
pHTemp
°C
Lysosomal acid glucosylceramidase
(Homo sapiens (Human))
BDBM18431
(Aminoquinoline compound, 16 | N-[4-methyl-2-(morph...)
Show SMILES CCCC1CCC(CC1)C(=O)Nc1ccc2nc(cc(C)c2c1)N1CCOCC1 |(-16.03,6.94,;-14.69,6.17,;-13.36,6.94,;-12.03,6.17,;-10.69,6.94,;-9.36,6.17,;-9.36,4.63,;-10.69,3.86,;-12.03,4.63,;-8.03,3.86,;-8.03,2.32,;-6.69,4.63,;-5.36,3.86,;-5.36,2.32,;-4.03,1.55,;-2.69,2.32,;-1.36,1.55,;-.02,2.32,;-.02,3.86,;-1.36,4.63,;-1.36,6.17,;-2.69,3.86,;-4.03,4.63,;1.31,1.55,;1.31,.01,;2.64,-.76,;3.98,.01,;3.98,1.55,;2.64,2.32,)|
Show InChI InChI=1S/C24H33N3O2/c1-3-4-18-5-7-19(8-6-18)24(28)25-20-9-10-22-21(16-20)17(2)15-23(26-22)27-11-13-29-14-12-27/h9-10,15-16,18-19H,3-8,11-14H2,1-2H3,(H,25,28)
Reactome pathway
55 -9.76 133n/an/an/an/a5.921
NIH
Assay Description
Enzyme activity was determined as the production of fluorescent resorufin from the substrate. The fluorescence was measured (excitation 570 nm, emiss...
Proc Natl Acad Sci U S A 104: 13192-7 (2007)
Article DOI: 10.1073/pnas.0705637104
BindingDB Entry DOI: 10.7270/Q2V1232M