null
SMILES: CCc1nnc(NC(=O)c2ccc(cc2)N(C)S(=O)(=O)c2ccccc2)s1
InChI Key: InChIKey=MPDJPMXCUKNYCN-UHFFFAOYSA-N
Activity Spreadsheet -- Enzyme Inhibition Constant Data from BindingDB
Found 1 hit for monomerid = 18441
Trg + Lig
Ki
nM
ΔG°
kcal/mole
IC50
nM
Kd
nM
EC50/IC50
nM
koff
s-1
kon
M-1s-1
pHTemp
°C
Lysosomal acid glucosylceramidase
(Homo sapiens (Human))
BDBM18441
(4-[benzene(methyl)sulfonamido]-N-(5-ethyl-1,3,4-th...)
Show SMILES CCc1nnc(NC(=O)c2ccc(cc2)N(C)S(=O)(=O)c2ccccc2)s1
Show InChI InChI=1S/C18H18N4O3S2/c1-3-16-20-21-18(26-16)19-17(23)13-9-11-14(12-10-13)22(2)27(24,25)15-7-5-4-6-8-15/h4-12H,3H2,1-2H3,(H,19,21,23)
Reactome pathway
8.44E+3 -6.82 2.96E+3n/an/an/an/a5.921
NIH
Assay Description
Enzyme activity was determined as the production of fluorescent resorufin from the substrate. The fluorescence was measured (excitation 570 nm, emiss...
Proc Natl Acad Sci U S A 104: 13192-7 (2007)
Article DOI: 10.1073/pnas.0705637104
BindingDB Entry DOI: 10.7270/Q2V1232M