null
SMILES: CN1CCN(Cc2cccc(c2)-c2ccc(cc2)[S+]([O-])(=O)Nc2c(C)nn(C)c2C)CC1
InChI Key: InChIKey=YNZKRPJYTPZVOL-UHFFFAOYSA-N
Activity Spreadsheet -- Enzyme Inhibition Constant Data from BindingDB
Found 3 hits for monomerid = 184859
Trg + Lig
Ki
nM
ΔG°
kcal/mole
IC50
nM
Kd
nM
EC50/IC50
nM
koff
s-1
kon
M-1s-1
pHTemp
°C
Glycylpeptide N-tetradecanoyltransferase
(Trypanosoma brucei)
BDBM184859
(US9156811, DDD86212)
Show SMILES CN1CCN(Cc2cccc(c2)-c2ccc(cc2)[S+]([O-])(=O)Nc2c(C)nn(C)c2C)CC1
Show InChI InChI=1S/C24H31N5O2S/c1-18-24(19(2)28(4)25-18)26-32(30,31)23-10-8-21(9-11-23)22-7-5-6-20(16-22)17-29-14-12-27(3)13-15-29/h5-11,16H,12-15,17H2,1-4H3,(H-,26,30,31)
US Patent
n/an/a 11n/an/an/an/a7.425
Univeristy of Dundee
US Patent
Assay Description
Measurement of the ability of compounds to inhibit the NMT-1 and/or NMT-2 enzyme isoforms of human, trypanosome (T. brucei), leishmanial (L. major) a...
US Patent US9156811 (2015)
BindingDB Entry DOI: 10.7270/Q2K35SGM
Glycylpeptide N-tetradecanoyltransferase
(Aspergillus fumigatus)
BDBM184859
(US9156811, DDD86212)
Show SMILES CN1CCN(Cc2cccc(c2)-c2ccc(cc2)[S+]([O-])(=O)Nc2c(C)nn(C)c2C)CC1
Show InChI InChI=1S/C24H31N5O2S/c1-18-24(19(2)28(4)25-18)26-32(30,31)23-10-8-21(9-11-23)22-7-5-6-20(16-22)17-29-14-12-27(3)13-15-29/h5-11,16H,12-15,17H2,1-4H3,(H-,26,30,31)
US Patent
n/an/a 15n/an/an/an/a7.425
Univeristy of Dundee
US Patent
Assay Description
Measurement of the ability of compounds to inhibit the NMT-1 and/or NMT-2 enzyme isoforms of human, trypanosome (T. brucei), leishmanial (L. major) a...
US Patent US9156811 (2015)
BindingDB Entry DOI: 10.7270/Q2K35SGM
Glycylpeptide N-tetradecanoyltransferase 1
(Homo sapiens (Human))
BDBM184859
(US9156811, DDD86212)
Show SMILES CN1CCN(Cc2cccc(c2)-c2ccc(cc2)[S+]([O-])(=O)Nc2c(C)nn(C)c2C)CC1
Show InChI InChI=1S/C24H31N5O2S/c1-18-24(19(2)28(4)25-18)26-32(30,31)23-10-8-21(9-11-23)22-7-5-6-20(16-22)17-29-14-12-27(3)13-15-29/h5-11,16H,12-15,17H2,1-4H3,(H-,26,30,31)
Reactome pathway
US Patent
n/an/a 8n/an/an/an/a7.425
Univeristy of Dundee
US Patent
Assay Description
Measurement of the ability of compounds to inhibit the NMT-1 and/or NMT-2 enzyme isoforms of human, trypanosome (T. brucei), leishmanial (L. major) a...
US Patent US9156811 (2015)
BindingDB Entry DOI: 10.7270/Q2K35SGM