BDBM185101 US9156811, DDD100807
SMILES: Cc1nn(C)c(C)c1N(C(F)F)[S+]([O-])(=O)c1c(Cl)cc(CCCCC2CCNCC2)cc1Cl
InChI Key: InChIKey=JEXUGPIZWWTQHG-UHFFFAOYSA-N
Data: 3 IC50
Activity Spreadsheet -- Enzyme Inhibition Constant Data from BindingDB
Found 3 hits for monomerid = 185101
Trg + Lig
Ki
nM
ΔG°
kcal/mole
IC50
nM
Kd
nM
EC50/IC50
nM
koff
s-1
kon
M-1s-1
pHTemp
°C
N-myristoyltransferase (NMT1)
(Trypanosoma brucei)
BDBM185101
(US9156811, DDD100807)
Show SMILES Cc1nn(C)c(C)c1N(C(F)F)[S+]([O-])(=O)c1c(Cl)cc(CCCCC2CCNCC2)cc1Cl
Show InChI InChI=1S/C22H30Cl2F2N4O2S/c1-14-20(15(2)29(3)28-14)30(22(25)26)33(31,32)21-18(23)12-17(13-19(21)24)7-5-4-6-16-8-10-27-11-9-16/h12-13,16,22,27H,4-11H2,1-3H3
US Patent
n/an/a 2n/an/an/an/a7.425
Univeristy of Dundee
US Patent
Assay Description
Measurement of the ability of compounds to inhibit the NMT-1 and/or NMT-2 enzyme isoforms of human, trypanosome (T. brucei), leishmanial (L. major) a...
US Patent US9156811 (2015)
BindingDB Entry DOI: 10.7270/Q2K35SGM
N-myristoyltransferase (NMT1)
(Leishmania major)
BDBM185101
(US9156811, DDD100807)
Show SMILES Cc1nn(C)c(C)c1N(C(F)F)[S+]([O-])(=O)c1c(Cl)cc(CCCCC2CCNCC2)cc1Cl
Show InChI InChI=1S/C22H30Cl2F2N4O2S/c1-14-20(15(2)29(3)28-14)30(22(25)26)33(31,32)21-18(23)12-17(13-19(21)24)7-5-4-6-16-8-10-27-11-9-16/h12-13,16,22,27H,4-11H2,1-3H3
US Patent
n/an/a 1n/an/an/an/a7.425
Univeristy of Dundee
US Patent
Assay Description
Measurement of the ability of compounds to inhibit the NMT-1 and/or NMT-2 enzyme isoforms of human, trypanosome (T. brucei), leishmanial (L. major) a...
US Patent US9156811 (2015)
BindingDB Entry DOI: 10.7270/Q2K35SGM
Myristoyl-CoA:protein N-myristoyltransferase (Nmt)
(Homo sapiens (Human))
BDBM185101
(US9156811, DDD100807)
Show SMILES Cc1nn(C)c(C)c1N(C(F)F)[S+]([O-])(=O)c1c(Cl)cc(CCCCC2CCNCC2)cc1Cl
Show InChI InChI=1S/C22H30Cl2F2N4O2S/c1-14-20(15(2)29(3)28-14)30(22(25)26)33(31,32)21-18(23)12-17(13-19(21)24)7-5-4-6-16-8-10-27-11-9-16/h12-13,16,22,27H,4-11H2,1-3H3
Reactome pathway
US Patent
n/an/a 4n/an/an/an/a7.425
Univeristy of Dundee
US Patent
Assay Description
Measurement of the ability of compounds to inhibit the NMT-1 and/or NMT-2 enzyme isoforms of human, trypanosome (T. brucei), leishmanial (L. major) a...
US Patent US9156811 (2015)
BindingDB Entry DOI: 10.7270/Q2K35SGM