BDBM185152 STK16-IN-1
SMILES: Oc1cc(ccc1F)-n1c2c3cc[nH]c3ncc2ccc1=O
InChI Key: InChIKey=XOUJEIXPUNKLEG-UHFFFAOYSA-N
Data: 10 IC50
Activity Spreadsheet -- Enzyme Inhibition Constant Data from BindingDB
Found 10 hits for monomerid = 185152
Trg + Lig
Ki
nM
ΔG°
kcal/mole
IC50
nM
Kd
nM
EC50/IC50
nM
koff
s-1
kon
M-1s-1
pHTemp
°C
Serine/threonine-protein kinase mTOR
(Homo sapiens (Human))
BDBM185152
(STK16-IN-1)
Show SMILES Oc1cc(ccc1F)-n1c2c3cc[nH]c3ncc2ccc1=O
Show InChI InChI=1S/C16H10FN3O2/c17-12-3-2-10(7-13(12)21)20-14(22)4-1-9-8-19-16-11(15(9)20)5-6-18-16/h1-8,21H,(H,18,19)
NCI pathway
Reactome pathway
n/an/a 5.56E+3n/an/an/an/an/an/a
Chinese Academy of Sciences
Assay Description
The enzymatic assay was performed using the LifeTechnology SelectScreen.
ACS Chem Biol 11: 1537-43 (2016)
Article DOI: 10.1021/acschembio.6b00250
BindingDB Entry DOI: 10.7270/Q29K491Z
Phosphatidylinositol 4-kinase alpha (PI4KA)
(Homo sapiens (Human))
BDBM185152
(STK16-IN-1)
Show SMILES Oc1cc(ccc1F)-n1c2c3cc[nH]c3ncc2ccc1=O
Show InChI InChI=1S/C16H10FN3O2/c17-12-3-2-10(7-13(12)21)20-14(22)4-1-9-8-19-16-11(15(9)20)5-6-18-16/h1-8,21H,(H,18,19)
n/an/a>1.00E+4n/an/an/an/an/an/a
Chinese Academy of Sciences
Assay Description
The enzymatic assay was performed using the LifeTechnology SelectScreen.
ACS Chem Biol 11: 1537-43 (2016)
Article DOI: 10.1021/acschembio.6b00250
BindingDB Entry DOI: 10.7270/Q29K491Z
Phosphatidylinositol 4-kinase beta
(Homo sapiens (Human))
BDBM185152
(STK16-IN-1)
Show SMILES Oc1cc(ccc1F)-n1c2c3cc[nH]c3ncc2ccc1=O
Show InChI InChI=1S/C16H10FN3O2/c17-12-3-2-10(7-13(12)21)20-14(22)4-1-9-8-19-16-11(15(9)20)5-6-18-16/h1-8,21H,(H,18,19)
n/an/a>1.00E+4n/an/an/an/an/an/a
Chinese Academy of Sciences
Assay Description
The enzymatic assay was performed using the LifeTechnology SelectScreen.
ACS Chem Biol 11: 1537-43 (2016)
Article DOI: 10.1021/acschembio.6b00250
BindingDB Entry DOI: 10.7270/Q29K491Z
Phosphatidylinositol 4-phosphate 3-kinase C2 domain-containing subunit alpha
(Homo sapiens (Human))
BDBM185152
(STK16-IN-1)
Show SMILES Oc1cc(ccc1F)-n1c2c3cc[nH]c3ncc2ccc1=O
Show InChI InChI=1S/C16H10FN3O2/c17-12-3-2-10(7-13(12)21)20-14(22)4-1-9-8-19-16-11(15(9)20)5-6-18-16/h1-8,21H,(H,18,19)
n/an/a 4.86E+3n/an/an/an/an/an/a
Chinese Academy of Sciences
Assay Description
The enzymatic assay was performed using the LifeTechnology SelectScreen.
ACS Chem Biol 11: 1537-43 (2016)
Article DOI: 10.1021/acschembio.6b00250
BindingDB Entry DOI: 10.7270/Q29K491Z
Tyrosine-protein kinase STK16 (STK16)
(Homo sapiens (Human))
BDBM185152
(STK16-IN-1)
Show SMILES Oc1cc(ccc1F)-n1c2c3cc[nH]c3ncc2ccc1=O
Show InChI InChI=1S/C16H10FN3O2/c17-12-3-2-10(7-13(12)21)20-14(22)4-1-9-8-19-16-11(15(9)20)5-6-18-16/h1-8,21H,(H,18,19)
n/an/a 295n/an/an/an/an/an/a
Chinese Academy of Sciences
Assay Description
The enzymatic assay was performed using the LifeTechnology SelectScreen.
ACS Chem Biol 11: 1537-43 (2016)
Article DOI: 10.1021/acschembio.6b00250
BindingDB Entry DOI: 10.7270/Q29K491Z
Phosphatidylinositol 3-kinase catalytic subunit type 3
(Homo sapiens (Human))
BDBM185152
(STK16-IN-1)
Show SMILES Oc1cc(ccc1F)-n1c2c3cc[nH]c3ncc2ccc1=O
Show InChI InChI=1S/C16H10FN3O2/c17-12-3-2-10(7-13(12)21)20-14(22)4-1-9-8-19-16-11(15(9)20)5-6-18-16/h1-8,21H,(H,18,19)
Reactome pathway
n/an/a 7.94E+3n/an/an/an/an/an/a
Chinese Academy of Sciences
Assay Description
The enzymatic assay was performed using the LifeTechnology SelectScreen.
ACS Chem Biol 11: 1537-43 (2016)
Article DOI: 10.1021/acschembio.6b00250
BindingDB Entry DOI: 10.7270/Q29K491Z
p110α/p85α
(Homo sapiens (Human))
BDBM185152
(STK16-IN-1)
Show SMILES Oc1cc(ccc1F)-n1c2c3cc[nH]c3ncc2ccc1=O
Show InChI InChI=1S/C16H10FN3O2/c17-12-3-2-10(7-13(12)21)20-14(22)4-1-9-8-19-16-11(15(9)20)5-6-18-16/h1-8,21H,(H,18,19)
n/an/a 1.07E+3n/an/an/an/an/an/a
Chinese Academy of Sciences
Assay Description
The enzymatic assay was performed using the LifeTechnology SelectScreen.
ACS Chem Biol 11: 1537-43 (2016)
Article DOI: 10.1021/acschembio.6b00250
BindingDB Entry DOI: 10.7270/Q29K491Z
Phosphoinositide 3-Kinase (PI3K), delta
(Homo sapiens (Human))
BDBM185152
(STK16-IN-1)
Show SMILES Oc1cc(ccc1F)-n1c2c3cc[nH]c3ncc2ccc1=O
Show InChI InChI=1S/C16H10FN3O2/c17-12-3-2-10(7-13(12)21)20-14(22)4-1-9-8-19-16-11(15(9)20)5-6-18-16/h1-8,21H,(H,18,19)
NCI pathway
Reactome pathway
n/an/a 856n/an/an/an/an/an/a
Chinese Academy of Sciences
Assay Description
The enzymatic assay was performed using the LifeTechnology SelectScreen.
ACS Chem Biol 11: 1537-43 (2016)
Article DOI: 10.1021/acschembio.6b00250
BindingDB Entry DOI: 10.7270/Q29K491Z
Phosphatidylinositol 4,5-bisphosphate 3-kinase catalytic subunit gamma isoform
(Homo sapiens (Human))
BDBM185152
(STK16-IN-1)
Show SMILES Oc1cc(ccc1F)-n1c2c3cc[nH]c3ncc2ccc1=O
Show InChI InChI=1S/C16H10FN3O2/c17-12-3-2-10(7-13(12)21)20-14(22)4-1-9-8-19-16-11(15(9)20)5-6-18-16/h1-8,21H,(H,18,19)
NCI pathway
Reactome pathway
n/an/a 867n/an/an/an/an/an/a
Chinese Academy of Sciences
Assay Description
The enzymatic assay was performed using the LifeTechnology SelectScreen.
ACS Chem Biol 11: 1537-43 (2016)
Article DOI: 10.1021/acschembio.6b00250
BindingDB Entry DOI: 10.7270/Q29K491Z
Phosphatidylinositol 4-phosphate 3-kinase C2 domain-containing subunit beta
(Homo sapiens (Human))
BDBM185152
(STK16-IN-1)
Show SMILES Oc1cc(ccc1F)-n1c2c3cc[nH]c3ncc2ccc1=O
Show InChI InChI=1S/C16H10FN3O2/c17-12-3-2-10(7-13(12)21)20-14(22)4-1-9-8-19-16-11(15(9)20)5-6-18-16/h1-8,21H,(H,18,19)
NCI pathway
Reactome pathway
n/an/a 9.33E+3n/an/an/an/an/an/a
Chinese Academy of Sciences
Assay Description
The enzymatic assay was performed using the LifeTechnology SelectScreen.
ACS Chem Biol 11: 1537-43 (2016)
Article DOI: 10.1021/acschembio.6b00250
BindingDB Entry DOI: 10.7270/Q29K491Z