BDBM18523 6-(1-Pyrrolidine)quinolin-2(1H)-one, 6b::6-[(2R,5R)-2-methyl-5-[(1S)-2,2,2-trifluoro-1-hydroxyethyl]pyrrolidin-1-yl]-4-(trifluoromethyl)-1,2-dihydroquinolin-2-one
SMILES: C[C@@H]1CC[C@H]([C@H](O)C(F)(F)F)N1c1ccc2[nH]c(=O)cc(c2c1)C(F)(F)F
InChI Key: InChIKey=HWLLYFXDDGGHOE-YVILZHTOSA-N
Data: 1 KI  1 EC50
Activity Spreadsheet -- Enzyme Inhibition Constant Data from BindingDB
Found 1 hit for monomerid = 18523
Trg + Lig
Ki
nM
ΔG°
kcal/mole
IC50
nM
Kd
nM
EC50/IC50
nM
koff
s-1
kon
M-1s-1
pHTemp
°C
Androgen Receptor
(Homo sapiens (Human))
BDBM18523
(6-(1-Pyrrolidine)quinolin-2(1H)-one, 6b | 6-[(2R,5...)
Show SMILES C[C@@H]1CC[C@H]([C@H](O)C(F)(F)F)N1c1ccc2[nH]c(=O)cc(c2c1)C(F)(F)F |r|
Show InChI InChI=1S/C17H16F6N2O2/c1-8-2-5-13(15(27)17(21,22)23)25(8)9-3-4-12-10(6-9)11(16(18,19)20)7-14(26)24-12/h3-4,6-8,13,15,27H,2,5H2,1H3,(H,24,26)/t8-,13-,15+/m1/s1
NCI pathway
Reactome pathway
7.60 -11.5n/an/a 8.40n/an/a7.437
Ligand Pharmaceuticals Inc.
Assay Description
The compounds were evaluated in a transcriptional activation assay with hAR in a mammalian cell background (CV-1) as the primary in vitro assay. Rece...
J Med Chem 50: 5049-52 (2007)
Article DOI: 10.1021/jm070231h
BindingDB Entry DOI: 10.7270/Q29Z935Z