BDBM18538 8-ethyl-4-(trifluoromethyl)-1H,2H,6H,7H,8H,9H-pyrido[3,2-g]quinolin-2-one::tricyclic quinoline compound, 6 (+/-)
SMILES: CCC1CCc2cc3c(cc(=O)[nH]c3cc2N1)C(F)(F)F
InChI Key: InChIKey=ULQSKZMHFWEHRP-UHFFFAOYSA-N
Data: 1 KI  1 IC50
Activity Spreadsheet -- Enzyme Inhibition Constant Data from BindingDB
Found 1 hit for monomerid = 18538
Trg + Lig
Ki
nM
ΔG°
kcal/mole
IC50
nM
Kd
nM
EC50/IC50
nM
koff
s-1
kon
M-1s-1
pHTemp
°C
Androgen Receptor
(Homo sapiens (Human))
BDBM18538
(8-ethyl-4-(trifluoromethyl)-1H,2H,6H,7H,8H,9H-pyri...)
Show SMILES CCC1CCc2cc3c(cc(=O)[nH]c3cc2N1)C(F)(F)F
Show InChI InChI=1S/C15H15F3N2O/c1-2-9-4-3-8-5-10-11(15(16,17)18)6-14(21)20-13(10)7-12(8)19-9/h5-7,9,19H,2-4H2,1H3,(H,20,21)
NCI pathway
Reactome pathway
11 -11.3 14n/an/an/an/a7.437
Ligand Pharmaceuticals Inc.
Assay Description
The compounds were evaluated in a transcriptional activation assay with hAR in a mammalian cell background (CV-1) as the primary in vitro assay. Rece...
Bioorg Med Chem Lett 17: 1523-6 (2007)
Article DOI: 10.1016/j.bmcl.2007.01.007
BindingDB Entry DOI: 10.7270/Q22J6950