BDBM18540 7-amino-4-(trifluoromethyl)-1,2-dihydroquinolin-2-one::amino-2-quinolinone, 8
SMILES: Nc1ccc2c(cc(=O)[nH]c2c1)C(F)(F)F
InChI Key: InChIKey=JBCMJMNWLFZJNV-UHFFFAOYSA-N
Data: 1 KI  1 IC50  1 EC50
Activity Spreadsheet -- Enzyme Inhibition Constant Data from BindingDB
Found 1 hit for monomerid = 18540
Trg + Lig
Ki
nM
ΔG°
kcal/mole
IC50
nM
Kd
nM
EC50/IC50
nM
koff
s-1
kon
M-1s-1
pHTemp
°C
Androgen Receptor
(Homo sapiens (Human))
BDBM18540
(7-amino-4-(trifluoromethyl)-1,2-dihydroquinolin-2-...)
Show SMILES Nc1ccc2c(cc(=O)[nH]c2c1)C(F)(F)F
Show InChI InChI=1S/C10H7F3N2O/c11-10(12,13)7-4-9(16)15-8-3-5(14)1-2-6(7)8/h1-4H,14H2,(H,15,16)
NCI pathway
Reactome pathway
407 -9.06 28n/a 1.30E+3n/an/a7.437
Ligand Pharmaceuticals Inc.
Assay Description
The compounds were evaluated in a transcriptional activation assay with hAR in a mammalian cell background (CV-1) as the primary in vitro assay. Rece...
Bioorg Med Chem Lett 17: 1523-6 (2007)
Article DOI: 10.1016/j.bmcl.2007.01.007
BindingDB Entry DOI: 10.7270/Q22J6950