BDBM185436 US9156845, 85
SMILES: COc1cc(F)cc(c1)-c1c[nH]c2ncnc(N3CCOCC3)c12
InChI Key: InChIKey=LZEFYMNXDMEWJB-UHFFFAOYSA-N
Data: 2 IC50
Activity Spreadsheet -- Enzyme Inhibition Constant Data from BindingDB
Found 2 hits for monomerid = 185436
Trg + Lig
Ki
nM
ΔG°
kcal/mole
IC50
nM
Kd
nM
EC50/IC50
nM
koff
s-1
kon
M-1s-1
pHTemp
°C
Leucine-rich repeat serine/threonine-protein kinase 2 G2019S
(Homo sapiens (Human))
BDBM185436
(US9156845, 85)
Show SMILES COc1cc(F)cc(c1)-c1c[nH]c2ncnc(N3CCOCC3)c12
Show InChI InChI=1S/C17H17FN4O2/c1-23-13-7-11(6-12(18)8-13)14-9-19-16-15(14)17(21-10-20-16)22-2-4-24-5-3-22/h6-10H,2-5H2,1H3,(H,19,20,21)
US Patent
n/an/a 20n/an/an/an/a7.5n/a
Pfizer Inc.
US Patent
Assay Description
LRRK2 kinase activity was measured using Lantha Screen technology from Invitrogen. GST-tagged truncated LRRK2 from Invitrogen (Cat # PV4874) was incu...
US Patent US9156845 (2015)
BindingDB Entry DOI: 10.7270/Q2DB80MW
Leucine-rich repeat serine/threonine-protein kinase 2 (LRRK2)
(Homo sapiens (Human))
BDBM185436
(US9156845, 85)
Show SMILES COc1cc(F)cc(c1)-c1c[nH]c2ncnc(N3CCOCC3)c12
Show InChI InChI=1S/C17H17FN4O2/c1-23-13-7-11(6-12(18)8-13)14-9-19-16-15(14)17(21-10-20-16)22-2-4-24-5-3-22/h6-10H,2-5H2,1H3,(H,19,20,21)
US Patent
n/an/a 9n/an/an/an/a7.5n/a
Pfizer Inc.
US Patent
Assay Description
LRRK2 kinase activity was measured using Lantha Screen technology from Invitrogen. GST-tagged truncated LRRK2 from Invitrogen (Cat # PV4874) was incu...
US Patent US9156845 (2015)
BindingDB Entry DOI: 10.7270/Q2DB80MW