BDBM185454 US9156845, 105
SMILES: Brc1cncc(c1)-c1c[nH]c2ncnc(N3CCOCC3)c12
InChI Key: InChIKey=WLBWMAISCIFWAN-UHFFFAOYSA-N
Data: 2 IC50
Activity Spreadsheet -- Enzyme Inhibition Constant Data from BindingDB
Found 2 hits for monomerid = 185454
Trg + Lig
Ki
nM
ΔG°
kcal/mole
IC50
nM
Kd
nM
EC50/IC50
nM
koff
s-1
kon
M-1s-1
pHTemp
°C
Leucine-rich repeat serine/threonine-protein kinase 2 G2019S
(Homo sapiens (Human))
BDBM185454
(US9156845, 105)
Show SMILES Brc1cncc(c1)-c1c[nH]c2ncnc(N3CCOCC3)c12
Show InChI InChI=1S/C15H14BrN5O/c16-11-5-10(6-17-7-11)12-8-18-14-13(12)15(20-9-19-14)21-1-3-22-4-2-21/h5-9H,1-4H2,(H,18,19,20)
US Patent
n/an/a 14n/an/an/an/a7.5n/a
Pfizer Inc.
US Patent
Assay Description
LRRK2 kinase activity was measured using Lantha Screen technology from Invitrogen. GST-tagged truncated LRRK2 from Invitrogen (Cat # PV4874) was incu...
US Patent US9156845 (2015)
BindingDB Entry DOI: 10.7270/Q2DB80MW
Leucine-rich repeat serine/threonine-protein kinase 2 (LRRK2)
(Homo sapiens (Human))
BDBM185454
(US9156845, 105)
Show SMILES Brc1cncc(c1)-c1c[nH]c2ncnc(N3CCOCC3)c12
Show InChI InChI=1S/C15H14BrN5O/c16-11-5-10(6-17-7-11)12-8-18-14-13(12)15(20-9-19-14)21-1-3-22-4-2-21/h5-9H,1-4H2,(H,18,19,20)
US Patent
n/an/a 6n/an/an/an/a7.5n/a
Pfizer Inc.
US Patent
Assay Description
LRRK2 kinase activity was measured using Lantha Screen technology from Invitrogen. GST-tagged truncated LRRK2 from Invitrogen (Cat # PV4874) was incu...
US Patent US9156845 (2015)
BindingDB Entry DOI: 10.7270/Q2DB80MW