BDBM185456 US9156845, 107
SMILES: Cc1cccc(c1)-c1c[nH]c2ncnc(N3CCOCC3)c12
InChI Key: InChIKey=JMAPTHRNJHOVDP-UHFFFAOYSA-N
Data: 2 IC50
Activity Spreadsheet -- Enzyme Inhibition Constant Data from BindingDB
Found 2 hits for monomerid = 185456
Trg + Lig
Ki
nM
ΔG°
kcal/mole
IC50
nM
Kd
nM
EC50/IC50
nM
koff
s-1
kon
M-1s-1
pHTemp
°C
Leucine-rich repeat serine/threonine-protein kinase 2 G2019S
(Homo sapiens (Human))
BDBM185456
(US9156845, 107)
Show SMILES Cc1cccc(c1)-c1c[nH]c2ncnc(N3CCOCC3)c12
Show InChI InChI=1S/C17H18N4O/c1-12-3-2-4-13(9-12)14-10-18-16-15(14)17(20-11-19-16)21-5-7-22-8-6-21/h2-4,9-11H,5-8H2,1H3,(H,18,19,20)
US Patent
n/an/a 20n/an/an/an/a7.5n/a
Pfizer Inc.
US Patent
Assay Description
LRRK2 kinase activity was measured using Lantha Screen technology from Invitrogen. GST-tagged truncated LRRK2 from Invitrogen (Cat # PV4874) was incu...
US Patent US9156845 (2015)
BindingDB Entry DOI: 10.7270/Q2DB80MW
Leucine-rich repeat serine/threonine-protein kinase 2 (LRRK2)
(Homo sapiens (Human))
BDBM185456
(US9156845, 107)
Show SMILES Cc1cccc(c1)-c1c[nH]c2ncnc(N3CCOCC3)c12
Show InChI InChI=1S/C17H18N4O/c1-12-3-2-4-13(9-12)14-10-18-16-15(14)17(20-11-19-16)21-5-7-22-8-6-21/h2-4,9-11H,5-8H2,1H3,(H,18,19,20)
US Patent
n/an/a 13n/an/an/an/a7.5n/a
Pfizer Inc.
US Patent
Assay Description
LRRK2 kinase activity was measured using Lantha Screen technology from Invitrogen. GST-tagged truncated LRRK2 from Invitrogen (Cat # PV4874) was incu...
US Patent US9156845 (2015)
BindingDB Entry DOI: 10.7270/Q2DB80MW