BDBM18553 7-[(2,2,3,3,3-pentafluoropropyl)amino]-4-(trifluoromethyl)-1,2-dihydroquinolin-2-one::alkylamino-2-quinolinone, 9m
SMILES: FC(F)(F)c1cc(=O)[nH]c2cc(NCC(F)(F)C(F)(F)F)ccc12
InChI Key: InChIKey=CCLXBKICDYKGFF-UHFFFAOYSA-N
Data: 1 KI  1 IC50
Activity Spreadsheet -- Enzyme Inhibition Constant Data from BindingDB
Found 1 hit for monomerid = 18553
Trg + Lig
Ki
nM
ΔG°
kcal/mole
IC50
nM
Kd
nM
EC50/IC50
nM
koff
s-1
kon
M-1s-1
pHTemp
°C
Androgen Receptor
(Homo sapiens (Human))
BDBM18553
(7-[(2,2,3,3,3-pentafluoropropyl)amino]-4-(trifluor...)
Show SMILES FC(F)(F)c1cc(=O)[nH]c2cc(NCC(F)(F)C(F)(F)F)ccc12
Show InChI InChI=1S/C13H8F8N2O/c14-11(15,13(19,20)21)5-22-6-1-2-7-8(12(16,17)18)4-10(24)23-9(7)3-6/h1-4,22H,5H2,(H,23,24)
NCI pathway
Reactome pathway
36 -10.6 58n/an/an/an/a7.437
Ligand Pharmaceuticals Inc.
Assay Description
The compounds were evaluated in a transcriptional activation assay with hAR in a mammalian cell background (CV-1) as the primary in vitro assay. Rece...
Bioorg Med Chem Lett 17: 1523-6 (2007)
Article DOI: 10.1016/j.bmcl.2007.01.007
BindingDB Entry DOI: 10.7270/Q22J6950