BDBM185599 US9156856, 9::US9493431, 9
SMILES: CC(C)N(C)CC[C@H](CSc1ccccc1)Nc1sc(cc1[N+]([O-])=O)S(=O)(=O)NC(=O)c1ccc(cc1)N1CCN(CC2=C(CCC(C)(C)C2)c2ccc(Cl)cc2)CC1
InChI Key: InChIKey=YIPXNZBKUIGDOH-PSXMRANNSA-N
Data: 2 KI
Activity Spreadsheet -- Enzyme Inhibition Constant Data from BindingDB
Found 2 hits for monomerid = 185599
Trg + Lig
Ki
nM
ΔG°
kcal/mole
IC50
nM
Kd
nM
EC50/IC50
nM
koff
s-1
kon
M-1s-1
pHTemp
°C
Apoptosis regulator Bcl-2/Glutathione S-transferase P
(Homo sapiens (Human))
BDBM185599
(US9156856, 9 | US9493431, 9)
Show SMILES CC(C)N(C)CC[C@H](CSc1ccccc1)Nc1sc(cc1[N+]([O-])=O)S(=O)(=O)NC(=O)c1ccc(cc1)N1CCN(CC2=C(CCC(C)(C)C2)c2ccc(Cl)cc2)CC1 |t:45|
Show InChI InChI=1S/C44H55ClN6O5S3/c1-31(2)48(5)22-20-36(30-57-38-9-7-6-8-10-38)46-43-40(51(53)54)27-41(58-43)59(55,56)47-42(52)33-13-17-37(18-14-33)50-25-23-49(24-26-50)29-34-28-44(3,4)21-19-39(34)32-11-15-35(45)16-12-32/h6-18,27,31,36,46H,19-26,28-30H2,1-5H3,(H,47,52)/t36-/m1/s1
US Patent
0.307 -13.0n/an/an/an/an/an/a25
ABBVIE INC.
US Patent
Assay Description
Representative compounds were serially diluted in dimethyl sulfoxide (DMSO) starting at 50 uM (2x starting concentration; 10% DMSO) and 10 uL were tr...
US Patent US9493431 (2016)
BindingDB Entry DOI: 10.7270/Q2RB73HH
Bcl-2-like protein 1
(Homo sapiens (Human))
BDBM185599
(US9156856, 9 | US9493431, 9)
Show SMILES CC(C)N(C)CC[C@H](CSc1ccccc1)Nc1sc(cc1[N+]([O-])=O)S(=O)(=O)NC(=O)c1ccc(cc1)N1CCN(CC2=C(CCC(C)(C)C2)c2ccc(Cl)cc2)CC1 |t:45|
Show InChI InChI=1S/C44H55ClN6O5S3/c1-31(2)48(5)22-20-36(30-57-38-9-7-6-8-10-38)46-43-40(51(53)54)27-41(58-43)59(55,56)47-42(52)33-13-17-37(18-14-33)50-25-23-49(24-26-50)29-34-28-44(3,4)21-19-39(34)32-11-15-35(45)16-12-32/h6-18,27,31,36,46H,19-26,28-30H2,1-5H3,(H,47,52)/t36-/m1/s1
NCI pathway
Reactome pathway
US Patent
0.307 -13.0n/an/an/an/an/an/a25
AbbVie Inc.
US Patent
Assay Description
Representative compounds were serially diluted in dimethyl sulfoxide (DMSO) starting at 50 μM (2× starting concentration; 10% DMSO) and 10 μ...
US Patent US9156856 (2015)
BindingDB Entry DOI: 10.7270/Q2125RFF