BDBM185610 US9156856, 20::US9493431, 20
SMILES: Cc1cc(C)n2nc(nc2n1)S(=O)(=O)NC(=O)c1ccc(cc1)N1CCN(Cc2ccccc2-c2ccc(Cl)cc2)CC1
InChI Key: InChIKey=VDNVSXFNVCMUJY-UHFFFAOYSA-N
Data: 2 KI
Activity Spreadsheet -- Enzyme Inhibition Constant Data from BindingDB
Found 2 hits for monomerid = 185610
Trg + Lig
Ki
nM
ΔG°
kcal/mole
IC50
nM
Kd
nM
EC50/IC50
nM
koff
s-1
kon
M-1s-1
pHTemp
°C
Apoptosis regulator Bcl-2/Glutathione S-transferase P
(Homo sapiens (Human))
BDBM185610
(US9156856, 20 | US9493431, 20)
Show SMILES Cc1cc(C)n2nc(nc2n1)S(=O)(=O)NC(=O)c1ccc(cc1)N1CCN(Cc2ccccc2-c2ccc(Cl)cc2)CC1
Show InChI InChI=1S/C31H30ClN7O3S/c1-21-19-22(2)39-30(33-21)34-31(35-39)43(41,42)36-29(40)24-9-13-27(14-10-24)38-17-15-37(16-18-38)20-25-5-3-4-6-28(25)23-7-11-26(32)12-8-23/h3-14,19H,15-18,20H2,1-2H3,(H,36,40)
US Patent
48.1 -9.98n/an/an/an/an/an/a25
ABBVIE INC.
US Patent
Assay Description
Representative compounds were serially diluted in dimethyl sulfoxide (DMSO) starting at 50 uM (2x starting concentration; 10% DMSO) and 10 uL were tr...
US Patent US9493431 (2016)
BindingDB Entry DOI: 10.7270/Q2RB73HH
Bcl-2-like protein 1
(Homo sapiens (Human))
BDBM185610
(US9156856, 20 | US9493431, 20)
Show SMILES Cc1cc(C)n2nc(nc2n1)S(=O)(=O)NC(=O)c1ccc(cc1)N1CCN(Cc2ccccc2-c2ccc(Cl)cc2)CC1
Show InChI InChI=1S/C31H30ClN7O3S/c1-21-19-22(2)39-30(33-21)34-31(35-39)43(41,42)36-29(40)24-9-13-27(14-10-24)38-17-15-37(16-18-38)20-25-5-3-4-6-28(25)23-7-11-26(32)12-8-23/h3-14,19H,15-18,20H2,1-2H3,(H,36,40)
NCI pathway
Reactome pathway
US Patent
48.1 -9.98n/an/an/an/an/an/a25
AbbVie Inc.
US Patent
Assay Description
Representative compounds were serially diluted in dimethyl sulfoxide (DMSO) starting at 50 μM (2× starting concentration; 10% DMSO) and 10 μ...
US Patent US9156856 (2015)
BindingDB Entry DOI: 10.7270/Q2125RFF