null
SMILES: COc1ccccc1N1CCCN(CCCCOc2ccc3CCC(=O)Nc3c2)CC1
InChI Key: InChIKey=FAKVJGDVZFHZPG-UHFFFAOYSA-N
Activity Spreadsheet -- Enzyme Inhibition Constant Data from BindingDB
Found 3 hits for monomerid = 185679
Trg + Lig
Ki
nM
ΔG°
kcal/mole
IC50
nM
Kd
nM
EC50/IC50
nM
koff
s-1
kon
M-1s-1
pHTemp
°C
D(2) dopamine receptor
(Homo sapiens (Human))
BDBM185679
(UNC10107953 | US9156822, 9)
Show SMILES COc1ccccc1N1CCCN(CCCCOc2ccc3CCC(=O)Nc3c2)CC1
Show InChI InChI=1S/C25H33N3O3/c1-30-24-8-3-2-7-23(24)28-15-6-14-27(16-17-28)13-4-5-18-31-21-11-9-20-10-12-25(29)26-22(20)19-21/h2-3,7-9,11,19H,4-6,10,12-18H2,1H3,(H,26,29)
Reactome pathway
US Patent
4n/an/an/an/an/an/a7.4n/a
The University of North Carolina at Chapel Hill
US Patent
Assay Description
Membranes prepared as above were resuspended to 1 ug protein/ul (measured by Bradford assay using BSA as standard), and 50 ul were added to each well...
US Patent US9156822 (2015)
BindingDB Entry DOI: 10.7270/Q2H41Q6D
D(2) dopamine receptor
(Homo sapiens (Human))
BDBM185679
(UNC10107953 | US9156822, 9)
Show SMILES COc1ccccc1N1CCCN(CCCCOc2ccc3CCC(=O)Nc3c2)CC1
Show InChI InChI=1S/C25H33N3O3/c1-30-24-8-3-2-7-23(24)28-15-6-14-27(16-17-28)13-4-5-18-31-21-11-9-20-10-12-25(29)26-22(20)19-21/h2-3,7-9,11,19H,4-6,10,12-18H2,1H3,(H,26,29)
Reactome pathway
US Patent
n/an/an/an/a 4.60n/an/a7.4n/a
The University of North Carolina at Chapel Hill
US Patent
Assay Description
Recruitment of β-arrestin to agonist-stimulated D2 receptors was performed using a previously described Tango-type assay (Barnea et al., Proc. N...
US Patent US9156822 (2015)
BindingDB Entry DOI: 10.7270/Q2H41Q6D
D(2) dopamine receptor
(Homo sapiens (Human))
BDBM185679
(UNC10107953 | US9156822, 9)
Show SMILES COc1ccccc1N1CCCN(CCCCOc2ccc3CCC(=O)Nc3c2)CC1
Show InChI InChI=1S/C25H33N3O3/c1-30-24-8-3-2-7-23(24)28-15-6-14-27(16-17-28)13-4-5-18-31-21-11-9-20-10-12-25(29)26-22(20)19-21/h2-3,7-9,11,19H,4-6,10,12-18H2,1H3,(H,26,29)
Reactome pathway
US Patent
n/an/an/an/a 163n/an/a7.4n/a
The University of North Carolina at Chapel Hill
US Patent
Assay Description
HEK293T cells co-expressing the cAMP biosensor GloSensor-22F (Promega) and hD2 receptors were seeded (10,000 cells/20 ul/well) into white, clear-bott...
US Patent US9156822 (2015)
BindingDB Entry DOI: 10.7270/Q2H41Q6D