null
SMILES: CC(C)Oc1ccccc1N1CCCN(CCCCOc2ccc3ccc(=O)[nH]c3c2)CC1
InChI Key: InChIKey=OKJIXAFKUUQQCX-UHFFFAOYSA-N
Activity Spreadsheet -- Enzyme Inhibition Constant Data from BindingDB
Found 3 hits for monomerid = 185688
Trg + Lig
Ki
nM
ΔG°
kcal/mole
IC50
nM
Kd
nM
EC50/IC50
nM
koff
s-1
kon
M-1s-1
pHTemp
°C
D(2) dopamine receptor
(Homo sapiens (Human))
BDBM185688
(UNC10107969 | US9156822, 18)
Show SMILES CC(C)Oc1ccccc1N1CCCN(CCCCOc2ccc3ccc(=O)[nH]c3c2)CC1
Show InChI InChI=1S/C27H35N3O3/c1-21(2)33-26-9-4-3-8-25(26)30-16-7-15-29(17-18-30)14-5-6-19-32-23-12-10-22-11-13-27(31)28-24(22)20-23/h3-4,8-13,20-21H,5-7,14-19H2,1-2H3,(H,28,31)
Reactome pathway
US Patent
0.930n/an/an/an/an/an/a7.4n/a
The University of North Carolina at Chapel Hill
US Patent
Assay Description
Membranes prepared as above were resuspended to 1 ug protein/ul (measured by Bradford assay using BSA as standard), and 50 ul were added to each well...
US Patent US9156822 (2015)
BindingDB Entry DOI: 10.7270/Q2H41Q6D
D(2) dopamine receptor
(Homo sapiens (Human))
BDBM185688
(UNC10107969 | US9156822, 18)
Show SMILES CC(C)Oc1ccccc1N1CCCN(CCCCOc2ccc3ccc(=O)[nH]c3c2)CC1
Show InChI InChI=1S/C27H35N3O3/c1-21(2)33-26-9-4-3-8-25(26)30-16-7-15-29(17-18-30)14-5-6-19-32-23-12-10-22-11-13-27(31)28-24(22)20-23/h3-4,8-13,20-21H,5-7,14-19H2,1-2H3,(H,28,31)
Reactome pathway
US Patent
n/an/an/an/a 4.20n/an/a7.4n/a
The University of North Carolina at Chapel Hill
US Patent
Assay Description
Recruitment of β-arrestin to agonist-stimulated D2 receptors was performed using a previously described Tango-type assay (Barnea et al., Proc. N...
US Patent US9156822 (2015)
BindingDB Entry DOI: 10.7270/Q2H41Q6D
D(2) dopamine receptor
(Homo sapiens (Human))
BDBM185688
(UNC10107969 | US9156822, 18)
Show SMILES CC(C)Oc1ccccc1N1CCCN(CCCCOc2ccc3ccc(=O)[nH]c3c2)CC1
Show InChI InChI=1S/C27H35N3O3/c1-21(2)33-26-9-4-3-8-25(26)30-16-7-15-29(17-18-30)14-5-6-19-32-23-12-10-22-11-13-27(31)28-24(22)20-23/h3-4,8-13,20-21H,5-7,14-19H2,1-2H3,(H,28,31)
Reactome pathway
US Patent
n/an/an/an/a 0.100n/an/a7.4n/a
The University of North Carolina at Chapel Hill
US Patent
Assay Description
HEK293T cells co-expressing the cAMP biosensor GloSensor-22F (Promega) and hD2 receptors were seeded (10,000 cells/20 ul/well) into white, clear-bott...
US Patent US9156822 (2015)
BindingDB Entry DOI: 10.7270/Q2H41Q6D