BDBM18569 US8846929, 362
SMILES: [H][C@]12CCC[C@]([H])(C[C@@]([H])(C1)n1c3ccccc3nc(C(O)=O)c1=O)N2C1CC2CCCC(C2)C1
InChI Key: InChIKey=COTYYZPYDJKKIS-KQMWNOITSA-N
Data: 4 KI
Activity Spreadsheet -- Enzyme Inhibition Constant Data from BindingDB
Found 4 hits for monomerid = 18569
Trg + Lig
Ki
nM
ΔG°
kcal/mole
IC50
nM
Kd
nM
EC50/IC50
nM
koff
s-1
kon
M-1s-1
pHTemp
°C
Opioid growth factor receptor-like protein 1
(Homo sapiens (Human))
BDBM18569
(US8846929, 362)
Show SMILES [H][C@]12CCC[C@]([H])(C[C@@]([H])(C1)n1c3ccccc3nc(C(O)=O)c1=O)N2C1CC2CCCC(C2)C1 |r,@:26,TLB:11:8:25:2.4.3|
Show InChI InChI=1S/C26H33N3O3/c30-25-24(26(31)32)27-22-9-1-2-10-23(22)29(25)21-14-18-7-4-8-19(15-21)28(18)20-12-16-5-3-6-17(11-16)13-20/h1-2,9-10,16-21H,3-8,11-15H2,(H,31,32)/t16?,17?,18-,19+,20?,21+
US Patent
2.40n/an/an/an/an/an/a7.4n/a
Purdue Pharma L.P.; Shionogi & Co., Ltd.
US Patent
Assay Description
Radioligand binding assays (screening and dose-displacement) used 0.1nM [3H]-nociceptin (NEN; 87.7 Cl/nimole) with 10-20 ug membrane protein in a fin...
US Patent US8846929 (2014)
BindingDB Entry DOI: 10.7270/Q2G44P04
Mu-type opioid receptor
(Homo sapiens (Human))
BDBM18569
(US8846929, 362)
Show SMILES [H][C@]12CCC[C@]([H])(C[C@@]([H])(C1)n1c3ccccc3nc(C(O)=O)c1=O)N2C1CC2CCCC(C2)C1 |r,@:26,TLB:11:8:25:2.4.3|
Show InChI InChI=1S/C26H33N3O3/c30-25-24(26(31)32)27-22-9-1-2-10-23(22)29(25)21-14-18-7-4-8-19(15-21)28(18)20-12-16-5-3-6-17(11-16)13-20/h1-2,9-10,16-21H,3-8,11-15H2,(H,31,32)/t16?,17?,18-,19+,20?,21+
NCI pathway
Reactome pathway
US Patent
1.63E+3n/an/an/an/an/an/a7.4n/a
Purdue Pharma L.P.; Shionogi & Co., Ltd.
US Patent
Assay Description
Radioligand dose-displacement binding assays for u-opioid receptors used 0.2nM[3H]-diprenorphine (NEN, Boston, Mass.), with 5-20mg membrane protein/w...
US Patent US8846929 (2014)
BindingDB Entry DOI: 10.7270/Q2G44P04
Kappa-type opioid receptor
(Homo sapiens (Human))
BDBM18569
(US8846929, 362)
Show SMILES [H][C@]12CCC[C@]([H])(C[C@@]([H])(C1)n1c3ccccc3nc(C(O)=O)c1=O)N2C1CC2CCCC(C2)C1 |r,@:26,TLB:11:8:25:2.4.3|
Show InChI InChI=1S/C26H33N3O3/c30-25-24(26(31)32)27-22-9-1-2-10-23(22)29(25)21-14-18-7-4-8-19(15-21)28(18)20-12-16-5-3-6-17(11-16)13-20/h1-2,9-10,16-21H,3-8,11-15H2,(H,31,32)/t16?,17?,18-,19+,20?,21+
Reactome pathway
US Patent
2.28E+3n/an/an/an/an/an/a7.4n/a
Purdue Pharma L.P.; Shionogi & Co., Ltd.
US Patent
Assay Description
Radioligand dose displacement assays used 0.4-0.8nM [3H]-U69,593 (NEN; 40 Ci/mmole) with 10-20 ug membrane protein (recombinant kappa opioid receptor...
US Patent US8846929 (2014)
BindingDB Entry DOI: 10.7270/Q2G44P04
Delta-type opioid receptor
(Homo sapiens (Human))
BDBM18569
(US8846929, 362)
Show SMILES [H][C@]12CCC[C@]([H])(C[C@@]([H])(C1)n1c3ccccc3nc(C(O)=O)c1=O)N2C1CC2CCCC(C2)C1 |r,@:26,TLB:11:8:25:2.4.3|
Show InChI InChI=1S/C26H33N3O3/c30-25-24(26(31)32)27-22-9-1-2-10-23(22)29(25)21-14-18-7-4-8-19(15-21)28(18)20-12-16-5-3-6-17(11-16)13-20/h1-2,9-10,16-21H,3-8,11-15H2,(H,31,32)/t16?,17?,18-,19+,20?,21+
Reactome pathway
US Patent
4.76E+3n/an/an/an/an/an/a7.4n/a
Purdue Pharma L.P.; Shionogi & Co., Ltd.
US Patent
Assay Description
Radioligand dose-displacement assays used 0.2nM [3H]-Naltrindole (NEN; 33.0 Ci/mmole) with 10-20ug membrane protein (recombinant delta opioid recepto...
US Patent US8846929 (2014)
BindingDB Entry DOI: 10.7270/Q2G44P04