BDBM18574 6-[(2-methylpropyl)amino]-4-(trifluoromethyl)-1,2-dihydroquinolin-2-one::6-alkylamino 2-quinolinone, 13f
SMILES: CC(C)CNc1ccc2[nH]c(=O)cc(c2c1)C(F)(F)F
InChI Key: InChIKey=VFFJPBUBVNBBPL-UHFFFAOYSA-N
Data: 1 KI  1 IC50  1 EC50
Activity Spreadsheet -- Enzyme Inhibition Constant Data from BindingDB
Found 1 hit for monomerid = 18574
Trg + Lig
Ki
nM
ΔG°
kcal/mole
IC50
nM
Kd
nM
EC50/IC50
nM
koff
s-1
kon
M-1s-1
pHTemp
°C
Androgen Receptor
(Homo sapiens (Human))
BDBM18574
(6-[(2-methylpropyl)amino]-4-(trifluoromethyl)-1,2-...)
Show SMILES CC(C)CNc1ccc2[nH]c(=O)cc(c2c1)C(F)(F)F
Show InChI InChI=1S/C14H15F3N2O/c1-8(2)7-18-9-3-4-12-10(5-9)11(14(15,16)17)6-13(20)19-12/h3-6,8,18H,7H2,1-2H3,(H,19,20)
NCI pathway
Reactome pathway
59n/a 22n/a 404n/an/an/an/a
Ligand Pharmaceuticals Inc.
Assay Description
The compounds were evaluated in a transcriptional activation assay with hAR in a mammalian cell background (CV-1) as the primary in vitro assay. Rece...
Bioorg Med Chem Lett 17: 1523-6 (2007)
Article DOI: 10.1016/j.bmcl.2007.01.007
BindingDB Entry DOI: 10.7270/Q22J6950