null
SMILES: [O-][N+](=O)c1ccc(\C=C\C(=O)Nc2ccccc2)cc1
InChI Key: InChIKey=ZVHMVWZNUNXORH-DHZHZOJOSA-N
Activity Spreadsheet -- Enzyme Inhibition Constant Data from BindingDB
Found 1 hit for monomerid = 185746
Trg + Lig
Ki
nM
ΔG°
kcal/mole
IC50
nM
Kd
nM
EC50/IC50
nM
koff
s-1
kon
M-1s-1
pHTemp
°C
Protein-glutamine gamma-glutamyltransferase 2
(Cavia cutleri (Guinea pig))
BDBM185746
(US9162991, 22a)
Show SMILES [O-][N+](=O)c1ccc(\C=C\C(=O)Nc2ccccc2)cc1
Show InChI InChI=1S/C15H12N2O3/c18-15(16-13-4-2-1-3-5-13)11-8-12-6-9-14(10-7-12)17(19)20/h1-11H,(H,16,18)/b11-8+
US Patent
n/an/a>2.00E+5n/an/an/an/an/an/a
University of Ottawa
US Patent
Assay Description
For enzymology studies of these compounds, recombinant guinea pig liver TGase was expressed in Escherichia coli and effectively purified (Gillet, S. ...
US Patent US9162991 (2015)
BindingDB Entry DOI: 10.7270/Q2VD6X8J