BDBM185903 US9163007, 410
SMILES: CCCCNc1n[nH]c2ccc(cc12)-c1cn(Cc2ccccc2)nn1
InChI Key: InChIKey=YAEXISXSUQTZCO-UHFFFAOYSA-N
Data: 1 KI
Activity Spreadsheet -- Enzyme Inhibition Constant Data from BindingDB
Found 1 hit for monomerid = 185903
Trg + Lig
Ki
nM
ΔG°
kcal/mole
IC50
nM
Kd
nM
EC50/IC50
nM
koff
s-1
kon
M-1s-1
pHTemp
°C
Cell division cycle 7-related protein kinase
(Homo sapiens (Human))
BDBM185903
(US9163007, 410)
Show SMILES CCCCNc1n[nH]c2ccc(cc12)-c1cn(Cc2ccccc2)nn1
Show InChI InChI=1S/C20H22N6/c1-2-3-11-21-20-17-12-16(9-10-18(17)22-24-20)19-14-26(25-23-19)13-15-7-5-4-6-8-15/h4-10,12,14H,2-3,11,13H2,1H3,(H2,21,22,24)
Reactome pathway
US Patent
40n/an/an/an/an/an/a7.5n/a
AbbVie Inc.
US Patent
Assay Description
11 data point. Cdc7 kinase assays were carried out in 25 mM HEPES, pH 7.5, 1 mM DTT, 10 mM MgCl2, 100 μM Na3VO4, and 0.075 mg/ml Triton X-100 u...
US Patent US9163007 (2015)
BindingDB Entry DOI: 10.7270/Q2KW5DTG