null
SMILES: CCOC(=O)CN(CC(F)(F)F)c1ccc2[nH]c(=O)cc(c2c1)C(F)(F)F
InChI Key: InChIKey=QTWPMOHCXRHUPV-UHFFFAOYSA-N
Activity Spreadsheet -- Enzyme Inhibition Constant Data from BindingDB
Found 1 hit for monomerid = 18596
Trg + Lig
Ki
nM
ΔG°
kcal/mole
IC50
nM
Kd
nM
EC50/IC50
nM
koff
s-1
kon
M-1s-1
pHTemp
°C
Androgen receptor
(Homo sapiens (Human))
BDBM18596
(6-bisalkylamino-2-quinolinone, 6u | ethyl 2-{[2-ox...)
Show SMILES CCOC(=O)CN(CC(F)(F)F)c1ccc2[nH]c(=O)cc(c2c1)C(F)(F)F
Show InChI InChI=1S/C16H14F6N2O3/c1-2-27-14(26)7-24(8-15(17,18)19)9-3-4-12-10(5-9)11(16(20,21)22)6-13(25)23-12/h3-6H,2,7-8H2,1H3,(H,23,25)
NCI pathway
Reactome pathway
19n/a 19n/a 20n/an/an/an/a
Ligand Pharmaceuticals Inc.
Assay Description
The compounds were evaluated in a transcriptional activation assay with hAR in a mammalian cell background (CV-1) as the primary in vitro assay. Rece...
Bioorg Med Chem Lett 17: 1527-31 (2007)
Article DOI: 10.1016/j.bmcl.2007.01.001
BindingDB Entry DOI: 10.7270/Q2XS5SP9