BDBM18601 6-[bis(2,2,2-trifluoroethyl)amino]-4-methyl-1,2-dihydroquinolin-2-one::6-bisalkylamino-2-quinolinone, 7b
SMILES: Cc1cc(=O)[nH]c2ccc(cc12)N(CC(F)(F)F)CC(F)(F)F
InChI Key: InChIKey=VGAKCOHWSSQOBR-UHFFFAOYSA-N
Data: 1 KI  1 EC50
PDB links: 1 PDB ID contains this monomer as substructures. 1 PDB ID contains inhibitors having a similarity of 90% to this monomer.
Activity Spreadsheet -- Enzyme Inhibition Constant Data from BindingDB
Found 1 hit for monomerid = 18601
Trg + Lig
Ki
nM
ΔG°
kcal/mole
IC50
nM
Kd
nM
EC50/IC50
nM
koff
s-1
kon
M-1s-1
pHTemp
°C
Androgen Receptor
(Homo sapiens (Human))
BDBM18601
(6-[bis(2,2,2-trifluoroethyl)amino]-4-methyl-1,2-di...)
Show SMILES Cc1cc(=O)[nH]c2ccc(cc12)N(CC(F)(F)F)CC(F)(F)F
Show InChI InChI=1S/C14H12F6N2O/c1-8-4-12(23)21-11-3-2-9(5-10(8)11)22(6-13(15,16)17)7-14(18,19)20/h2-5H,6-7H2,1H3,(H,21,23)
NCI pathway
Reactome pathway
1.40n/an/an/a 0.800n/an/an/an/a
Ligand Pharmaceuticals Inc.
Assay Description
The compounds were evaluated in a transcriptional activation assay with hAR in a mammalian cell background (CV-1) as the primary in vitro assay. Rece...
Bioorg Med Chem Lett 17: 1527-31 (2007)
Article DOI: 10.1016/j.bmcl.2007.01.001
BindingDB Entry DOI: 10.7270/Q2XS5SP9