BDBM18676 (2S)-3-[(4-fluorophenyl)amino]-2-hydroxy-2-methyl-N-[4-nitro-3-(trifluoromethyl)phenyl]propanamide::Nonsteroidal AR Ligand, S-17
SMILES: C[C@](O)(CNc1ccc(F)cc1)C(=O)Nc1ccc(c(c1)C(F)(F)F)[N+]([O-])=O
InChI Key: InChIKey=MEPOVXQYRHYVOZ-INIZCTEOSA-N
Data: 1 KI
Activity Spreadsheet -- Enzyme Inhibition Constant Data from BindingDB
Found 1 hit for monomerid = 18676
Trg + Lig
Ki
nM
ΔG°
kcal/mole
IC50
nM
Kd
nM
EC50/IC50
nM
koff
s-1
kon
M-1s-1
pHTemp
°C
Androgen receptor
(Rattus norvegicus (Rat))
BDBM18676
((2S)-3-[(4-fluorophenyl)amino]-2-hydroxy-2-methyl-...)
Show SMILES C[C@](O)(CNc1ccc(F)cc1)C(=O)Nc1ccc(c(c1)C(F)(F)F)[N+]([O-])=O |r|
Show InChI InChI=1S/C17H15F4N3O4/c1-16(26,9-22-11-4-2-10(18)3-5-11)15(25)23-12-6-7-14(24(27)28)13(8-12)17(19,20)21/h2-8,22,26H,9H2,1H3,(H,23,25)/t16-/m0/s1
Reactome pathway
7.96 -10.3n/an/an/an/an/a7.44
University of Tennessee at Memphis
Assay Description
The Ki values were determined by the application of the Cheng-Prusoff equation: Ki = (IC50 x Kd)/(Kd+[L]) where [L] is the concentration of [3H]MIB (...
J Med Chem 47: 993-8 (2004)
Article DOI: 10.1021/jm030336u
BindingDB Entry DOI: 10.7270/Q2JH3JFB