BDBM186928 US9079895, 20r
SMILES: O=C(CN1CCO[C@@H](COc2cccnc2)C1)N1CCc2ccccc12
InChI Key: InChIKey=XYHRHHHLNLGIRG-GOSISDBHSA-N
Data: 2 KI
Activity Spreadsheet -- Enzyme Inhibition Constant Data from BindingDB
Found 2 hits for monomerid = 186928
Trg + Lig
Ki
nM
ΔG°
kcal/mole
IC50
nM
Kd
nM
EC50/IC50
nM
koff
s-1
kon
M-1s-1
pHTemp
°C
5-hydroxytryptamine receptor 2A (5HT2A)
(Mus musculus (Mouse))
BDBM186928
(US9079895, 20r)
Show SMILES O=C(CN1CCO[C@@H](COc2cccnc2)C1)N1CCc2ccccc12 |r|
Show InChI InChI=1S/C20H23N3O3/c24-20(23-9-7-16-4-1-2-6-19(16)23)14-22-10-11-25-18(13-22)15-26-17-5-3-8-21-12-17/h1-6,8,12,18H,7,9-11,13-15H2/t18-/m1/s1
US Patent
2.66E+3n/an/an/an/an/an/a7.4n/a
University of Dundee
US Patent
Assay Description
The detailed experimental protocols for the radioligand and functional receptor assays are available on the NIMH PDSP website at http://pdsp.med.un...
US Patent US9079895 (2015)
BindingDB Entry DOI: 10.7270/Q2D7996K
5-hydroxytryptamine receptor 2B (5HT2B)
(Mus musculus (Mouse))
BDBM186928
(US9079895, 20r)
Show SMILES O=C(CN1CCO[C@@H](COc2cccnc2)C1)N1CCc2ccccc12 |r|
Show InChI InChI=1S/C20H23N3O3/c24-20(23-9-7-16-4-1-2-6-19(16)23)14-22-10-11-25-18(13-22)15-26-17-5-3-8-21-12-17/h1-6,8,12,18H,7,9-11,13-15H2/t18-/m1/s1
US Patent
8.81E+3n/an/an/an/an/an/a7.4n/a
University of Dundee
US Patent
Assay Description
The detailed experimental protocols for the radioligand and functional receptor assays are available on the NIMH PDSP website at http://pdsp.med.un...
US Patent US9079895 (2015)
BindingDB Entry DOI: 10.7270/Q2D7996K