null
SMILES: Clc1cncc(OC[C@@H]2CN(CCN3CCc4ccccc34)CCO2)c1
InChI Key: InChIKey=QURJBQQAYVMKHZ-IBGZPJMESA-N
Activity Spreadsheet -- Enzyme Inhibition Constant Data from BindingDB
Found 3 hits for monomerid = 186942
Trg + Lig
Ki
nM
ΔG°
kcal/mole
IC50
nM
Kd
nM
EC50/IC50
nM
koff
s-1
kon
M-1s-1
pHTemp
°C
D(4) dopamine receptor
(Mus musculus (Mouse))
BDBM186942
(US9079895, 27s)
Show SMILES Clc1cncc(OC[C@@H]2CN(CCN3CCc4ccccc34)CCO2)c1 |r|
Show InChI InChI=1S/C20H24ClN3O2/c21-17-11-18(13-22-12-17)26-15-19-14-23(9-10-25-19)7-8-24-6-5-16-3-1-2-4-20(16)24/h1-4,11-13,19H,5-10,14-15H2/t19-/m0/s1
US Patent
90n/an/an/an/an/an/a7.4n/a
University of Dundee
US Patent
Assay Description
The detailed experimental protocols for the radioligand and functional receptor assays are available on the NIMH PDSP website at http://pdsp.med.un...
US Patent US9079895 (2015)
BindingDB Entry DOI: 10.7270/Q2D7996K
D(1A) dopamine receptor
(Mus musculus (Mouse))
BDBM186942
(US9079895, 27s)
Show SMILES Clc1cncc(OC[C@@H]2CN(CCN3CCc4ccccc34)CCO2)c1 |r|
Show InChI InChI=1S/C20H24ClN3O2/c21-17-11-18(13-22-12-17)26-15-19-14-23(9-10-25-19)7-8-24-6-5-16-3-1-2-4-20(16)24/h1-4,11-13,19H,5-10,14-15H2/t19-/m0/s1
US Patent
5.85E+3n/an/an/an/an/an/a7.4n/a
University of Dundee
US Patent
Assay Description
The detailed experimental protocols for the radioligand and functional receptor assays are available on the NIMH PDSP website at http://pdsp.med.un...
US Patent US9079895 (2015)
BindingDB Entry DOI: 10.7270/Q2D7996K
D(2) dopamine receptor
(Mus musculus (Mouse))
BDBM186942
(US9079895, 27s)
Show SMILES Clc1cncc(OC[C@@H]2CN(CCN3CCc4ccccc34)CCO2)c1 |r|
Show InChI InChI=1S/C20H24ClN3O2/c21-17-11-18(13-22-12-17)26-15-19-14-23(9-10-25-19)7-8-24-6-5-16-3-1-2-4-20(16)24/h1-4,11-13,19H,5-10,14-15H2/t19-/m0/s1
US Patent
>1.00E+4n/an/an/an/an/an/a7.4n/a
University of Dundee
US Patent
Assay Description
The detailed experimental protocols for the radioligand and functional receptor assays are available on the NIMH PDSP website at http://pdsp.med.un...
US Patent US9079895 (2015)
BindingDB Entry DOI: 10.7270/Q2D7996K