BDBM18696 (2S)-N-[4-cyano-3-(trifluoromethyl)phenyl]-2-hydroxy-3-[(3-isothiocyanatophenyl)sulfanyl]-2-methylpropanamide::Bicalutamide Analogue, (S)-8
SMILES: C[C@@](O)(CSc1cccc(c1)N=C=S)C(=O)Nc1ccc(C#N)c(c1)C(F)(F)F
InChI Key: InChIKey=TWMKHPVCLNCRKT-GOSISDBHSA-N
Data: 2 KI
Activity Spreadsheet -- Enzyme Inhibition Constant Data from BindingDB
Found 2 hits for monomerid = 18696
Trg + Lig
Ki
nM
ΔG°
kcal/mole
IC50
nM
Kd
nM
EC50/IC50
nM
koff
s-1
kon
M-1s-1
pHTemp
°C
Androgen Receptor
(Rattus norvegicus (Rat))
BDBM18696
((2S)-N-[4-cyano-3-(trifluoromethyl)phenyl]-2-hydro...)
Show SMILES C[C@@](O)(CSc1cccc(c1)N=C=S)C(=O)Nc1ccc(C#N)c(c1)C(F)(F)F |r|
Show InChI InChI=1S/C19H14F3N3O2S2/c1-18(27,10-29-15-4-2-3-13(7-15)24-11-28)17(26)25-14-6-5-12(9-23)16(8-14)19(20,21)22/h2-8,27H,10H2,1H3,(H,25,26)/t18-/m1/s1
Reactome pathway
129n/an/an/an/an/an/an/an/a
CSC-Scientific Computing Ltd.
Curated by ChEMBL
Assay Description
Inhibition of [3H]mibolerone binding to cytosolic androgen receptor of rat ventral prostate
J Med Chem 48: 917-25 (2005)
Article DOI: 10.1021/jm0495879
BindingDB Entry DOI: 10.7270/Q2SJ1PBD
Androgen receptor
(Rattus norvegicus (Rat))
BDBM18696
((2S)-N-[4-cyano-3-(trifluoromethyl)phenyl]-2-hydro...)
Show SMILES C[C@@](O)(CSc1cccc(c1)N=C=S)C(=O)Nc1ccc(C#N)c(c1)C(F)(F)F |r|
Show InChI InChI=1S/C19H14F3N3O2S2/c1-18(27,10-29-15-4-2-3-13(7-15)24-11-28)17(26)25-14-6-5-12(9-23)16(8-14)19(20,21)22/h2-8,27H,10H2,1H3,(H,25,26)/t18-/m1/s1
Reactome pathway
130 -8.73n/an/an/an/an/a7.44
University of Tennessee at Memphis
Assay Description
The Ki values were determined by the application of the Cheng-Prusoff equation: Ki = (IC50 x Kd)/(Kd+[L]) where [L] is the concentration of [3H]MIB (...
J Med Chem 43: 581-90 (2000)
Article DOI: 10.1021/jm990027x
BindingDB Entry DOI: 10.7270/Q2DR2SR2