BDBM187208 US9670181, 84 6,7-dimethoxy-4-((6-methoxyquinolin-3-yl)methyl)-1-propylisoquinolin-3-ol
SMILES: CCCc1nc(O)c(Cc2cnc3ccc(OC)cc3c2)c2cc(OC)c(OC)cc12
InChI Key: InChIKey=CJVDWJPLBJARQN-UHFFFAOYSA-N
Data: 1 IC50
Activity Spreadsheet -- Enzyme Inhibition Constant Data from BindingDB
Found 1 hit for monomerid = 187208
Trg + Lig
Ki
nM
ΔG°
kcal/mole
IC50
nM
Kd
nM
EC50/IC50
nM
koff
s-1
kon
M-1s-1
pHTemp
°C
cAMP and cAMP-inhibited cGMP 3',5'-cyclic phosphodiesterase 10A
(Homo sapiens (Human))
BDBM187208
(US9670181, 84 6,7-dimethoxy-4-((6-methoxyquinolin-...)
Show SMILES CCCc1nc(O)c(Cc2cnc3ccc(OC)cc3c2)c2cc(OC)c(OC)cc12
Show InChI InChI=1S/C25H26N2O4/c1-5-6-22-19-13-24(31-4)23(30-3)12-18(19)20(25(28)27-22)10-15-9-16-11-17(29-2)7-8-21(16)26-14-15/h7-9,11-14H,5-6,10H2,1-4H3,(H,27,28)
Reactome pathway
US Patent
n/an/a 1.60n/an/an/an/a7.425
ALLERGAN, INC.; EXONHIT THERAPEUTICS SA
US Patent
Assay Description
The PDE assay is based on the homogenous time-resolved fluorescence resonance energy transfer (TR-FRET) technology (LANCE® from Perkin Elmer). This c...
US Patent US9670181 (2017)
BindingDB Entry DOI: 10.7270/Q21Z42KJ